﻿"Dublin Core:Title","Dublin Core:Creator","Dublin Core:Contributor","Dublin Core:Date","Dublin Core:Type","Dublin Core:Format","Dublin Core:Language","Dublin Core:Subject","Dublin Core:Description","Dublin Core:Source","Dublin Core:Abstract","Dublin Core:Spatial Coverage","Dublin Core:Publisher","Dublin Core:Provenance","Dublin Core:Rights","Dublin Core:Relation","Dublin Core:Identifier","Dublin Core:Coverage","Dublin Core:Alternative Title","Dublin Core:Table Of Contents","Dublin Core:Date Available","Dublin Core:Date Created","Dublin Core:Date Accepted","Dublin Core:Date Copyrighted","Dublin Core:Date Submitted","Dublin Core:Date Issued","Dublin Core:Date Modified","Dublin Core:Date Valid","Dublin Core:Access Rights","Dublin Core:License","Dublin Core:Conforms To","Dublin Core:Has Format","Dublin Core:Has Part","Dublin Core:Has Version","Dublin Core:Is Format Of","Dublin Core:Is Part Of","Dublin Core:Is Referenced By","Dublin Core:Is Replaced By","Dublin Core:Is Required By","Dublin Core:Is Version Of","Dublin Core:References","Dublin Core:Replaces","Dublin Core:Requires","Dublin Core:Extent","Dublin Core:Medium","Dublin Core:Bibliographic Citation","Dublin Core:Temporal Coverage","Dublin Core:Accrual Method","Dublin Core:Accrual Periodicity","Dublin Core:Accrual Policy","Dublin Core:Audience","Dublin Core:Audience Education Level","Dublin Core:Mediator","Dublin Core:Instructional Method","Dublin Core:Rights Holder","Item Type Metadata:Text","Item Type Metadata:Interviewer","Item Type Metadata:Interviewee","Item Type Metadata:Location","Item Type Metadata:Transcription","Item Type Metadata:URL local","Item Type Metadata:Format original","Item Type Metadata:Dimensions físiques","Item Type Metadata:Duration","Item Type Metadata:Compression","Item Type Metadata:Producer","Item Type Metadata:Director","Item Type Metadata:Bit Rate/Frequency","Item Type Metadata:Time Summary","Item Type Metadata:Email Body","Item Type Metadata:Subject Line","Item Type Metadata:From","Item Type Metadata:To","Item Type Metadata:CC","Item Type Metadata:BCC","Item Type Metadata:Number of Attachments","Item Type Metadata:Standards","Item Type Metadata:Objectives","Item Type Metadata:Materials","Item Type Metadata:Lesson Plan Text","Item Type Metadata:URL","Item Type Metadata:Event Type","Item Type Metadata:Participants","Item Type Metadata:Birth Date","Item Type Metadata:Birthplace","Item Type Metadata:Death Date","Item Type Metadata:Occupation","Item Type Metadata:Biographical Text","Item Type Metadata:Bibliography","Item Type Metadata:Edition Statement","Item Type Metadata:Publication Statement","Item Type Metadata:Note statement","Item Type Metadata:Profile description : Creation","Item Type Metadata:Profile description : Descriptive Rules","Item Type Metadata:Profile description : Language Usage","Item Type Metadata:Revision Description : Change","Item Type Metadata:Revision Description : List","Item Type Metadata:Front matter : Title page","Item Type Metadata:Front matter : Division","Item Type Metadata:Destinatari","Item Type Metadata:Número de caixa","Item Type Metadata:Localització de la caixa","EAD Archive:Level","EAD Archive:Arrangement","EAD Archive:Descriptive Identification : Heading","EAD Archive:Descriptive Identification : Note","EAD Archive:Appraisal Information","EAD Archive:Biography or History","EAD Archive:Index","EAD Archive:Note","EAD Archive:Other Descriptive Data","EAD Archive:Processing Information","EAD Archive:Scope and Content","EAD Archive:Heading","EAD Archive:Table Head","PDF Text:Text",tags,file,itemType,collection,public,featured
"¡Felicitats, Catalunya!","Maragall, Pasqual, 1941-",,2006-08-09,Article,Textual,Català,Estatut,,"El Periódico de Catalunya",,,,,,,1393,,,,,,,,,,,,,,,,,,,,,,,,,,,,,,,,,,,,,,,,,,,,,,,,,,,,,,,,,,,,,,,,,,,,,,,,,,,,,,,,,,,,,,Document,,,,,,,,,,,,,,Articles,https://www.arxiupmaragall.catalunyaeuropa.net/files/original/27/1698/0000000633.pdf,,"12.01. Activitat de representació (com a President)",1,0
"Agraïment i força","Maragall, Pasqual, 1941-",,2012-04-15,Article,Textual,Català,"Homenatges i distincions",,"El Periódico de Catalunya","Article de Pasqual Maragall publicat a El Periódico, sobre el fet d'haver estat triat Català de l'Any 2007.",,,,,,,,,,,,,,,,,,,,,,,,,,,,,,,,,,,,,,,,,,,,,,,,,,,,,,,,,,,,,,,,,,,,,,,,,,,,,,,,,,,,,,,,,,,,Document,,,,,,,,,,,,,,Articles,https://www.arxiupmaragall.catalunyaeuropa.net/files/original/21/1724/0000001320.pdf,,"13. Expresident de la Generalitat de Catalunya",1,0
"Barcelona, capital del mundo iberoamericano","Maragall, Pasqual, 1941-",,1997-03-13,Article,Textual,Castellà,"Amèrica Llatina",,"El Periódico de Catalunya",,,,"Aquest document és còpia digital de la còpia en paper custodiada a l'Arxiu Nacional de Catalunya.",,,,,,,,,,,,,,,,,,,,,,,,,,,,,,,,,,,,,,,,,,,,,,,,,,,,,,,,,,,,,,,,,,,,,,,,,,,,,,,,,,,,,,,,,Document,"UI 527",,,,,,,,,,,,,Articles,https://www.arxiupmaragall.catalunyaeuropa.net/files/original/30/2808/19970313_ElPerdiodico_BCNCapitalMundoIberoamericano_PM.pdf,,"09.01. Activitat de representació (com a Alcalde)",1,0
"Bona salut política","Maragall, Pasqual, 1941-",,2007-10-22,Article,Textual,Català,Salut,,"El Periódico de Catalunya",,,,,,,1534,,,,,,,,,,,,,,,,,,,,,,,,,,,,,,,,,,,,,,,,,,,,,,,,,,,,,,,,,,,,,,,,,,,,,,,,,,,,,,,,,,,,,,Document,,,,,,,,,,,,,,Articles,https://www.arxiupmaragall.catalunyaeuropa.net/files/original/21/1710/0000000811.pdf,,"13. Expresident de la Generalitat de Catalunya",1,0
"Carta oberta sobre la reforma estatutària","Maragall, Pasqual, 1941-",,2005-09-25,Article,Textual,Català,Estatut,,"El Periódico de Catalunya","El president de la Generalitat, Pasqual Maragall, va difondre ahir una carta oberta als catalans en la qual demana suport unànime al nou Estatut i promet vetllar perquè ningú trenqui, amb propostes inconstitucionals, «el somni» d’un millor autogovern.",,,,,,,,,,,,,,,,,,,,,,,,,,,,,,,,,,,,,,,,,,,,,,,,,,,,,,,,,,,,,,,,,,,,,,,,,,,,,,,,,,,,,,,,,,,,Document,,,,,,,,,,,,,,Articles,https://www.arxiupmaragall.catalunyaeuropa.net/files/original/27/1729/0000001574.pdf,,"12.01. Activitat de representació (com a President)",1,0
"Catalunya està de dol","Maragall, Pasqual, 1941-",,2004-01-14,Article,Textual,Català,"Reventós, Joan, 1927-2004",,"El Periódico de Catalunya","Article també publicat a La Vangaurdia (en castellà).",,,,,,,,,,,,,,,,,,,,,,,,,,,,,,,,,,,,,,,,,,,,,,,,,,,,,,,,,,,,,,,,,,,,,,,,,,,,,,,,,,,,,,,,,,,,Document,,,,,,,,,,,,,,Articles,https://www.arxiupmaragall.catalunyaeuropa.net/files/original/27/1734/0000001570.pdf,,"12.01. Activitat de representació (com a President)",1,0
"Catalunya ha parlat","Maragall, Pasqual, 1941-",,2005-10-02,Article,Textual,Català,Estatut,,"El Periódico de Catalunya",,,,,,,1337,,,,,,,,,,,,,,,,,,,,,,,,,,,,,,,,,,,,,,,,,,,,,,,,,,,,,,,,,,,,,,,,,,,,,,,,,,,,,,,,,,,,,,Document,,,,,,,,,,,,,,Articles,https://www.arxiupmaragall.catalunyaeuropa.net/files/original/27/1680/0000000643.pdf,,"12.01. Activitat de representació (com a President)",1,0
"Catalunya tindrà un segon tripartit","Maragall, Pasqual, 1941-",,2006-05-11,Article,Textual,Català,Eleccions,,"El Periódico de Catalunya",,,,,,,,,,,,,,,,,,,,,,,,,,,,,,,,,,,,,,,,,,,,,,,,,,,,,,,,,,,,,,,,,,,,,,,,,,,,,,,,,,,,,,,,,,,,,Document,,,,,,,,,,,,,,Articles,https://www.arxiupmaragall.catalunyaeuropa.net/files/original/23/1725/0000001579.pdf,,"04.02. Activitat política",1,0
"Clos a Indústria i la relació Catalunya-Espanya","Maragall, Pasqual, 1941-",,2006-08-31,Article,Textual,Català,"Clos i Gimenez, Joan, 1945-",,"El Periódico de Catalunya",,,,,,,1396,,,,,,,,,,,,,,,,,,,,,,,,,,,,,,,,,,,,,,,,,,,,,,,,,,,,,,,,,,,,,,,,,,,,,,,,,,,,,,,,,,,,,,Document,,,,,,,,,,,,,,Articles,https://www.arxiupmaragall.catalunyaeuropa.net/files/original/27/1700/0000000630.pdf,,"12.01. Activitat de representació (com a President)",1,0
"Corporativismo y Administración Pública","Maragall, Pasqual, 1941-",,1980-07-05,Article,Textual,Castellà,"Administració pública",,"El Periódico de Catalunya",,,,"Aquest document és còpia digital de la còpia en paper custodiada a l'Arxiu Nacional de Catalunya.",,,,,,,,,,,,,,,,,,,,,,,,,,,,,,,,,,,,,,,,,,,,,,,,,,,,,,,,,,,,,,,,,,,,,,,,,,,,,,,,,,,,,,,,,Document,"UI 538",,,,,,,,,,,,,Articles,https://www.arxiupmaragall.catalunyaeuropa.net/files/original/4/2796/19800705_ElPeriodico_CorporativismoAdmPub_PM.pdf,,"08. Tinent d'Alcalde",1,0
