﻿"Dublin Core:Title","Dublin Core:Creator","Dublin Core:Contributor","Dublin Core:Date","Dublin Core:Type","Dublin Core:Format","Dublin Core:Language","Dublin Core:Subject","Dublin Core:Description","Dublin Core:Source","Dublin Core:Abstract","Dublin Core:Spatial Coverage","Dublin Core:Publisher","Dublin Core:Provenance","Dublin Core:Rights","Dublin Core:Relation","Dublin Core:Identifier","Dublin Core:Coverage","Dublin Core:Alternative Title","Dublin Core:Table Of Contents","Dublin Core:Date Available","Dublin Core:Date Created","Dublin Core:Date Accepted","Dublin Core:Date Copyrighted","Dublin Core:Date Submitted","Dublin Core:Date Issued","Dublin Core:Date Modified","Dublin Core:Date Valid","Dublin Core:Access Rights","Dublin Core:License","Dublin Core:Conforms To","Dublin Core:Has Format","Dublin Core:Has Part","Dublin Core:Has Version","Dublin Core:Is Format Of","Dublin Core:Is Part Of","Dublin Core:Is Referenced By","Dublin Core:Is Replaced By","Dublin Core:Is Required By","Dublin Core:Is Version Of","Dublin Core:References","Dublin Core:Replaces","Dublin Core:Requires","Dublin Core:Extent","Dublin Core:Medium","Dublin Core:Bibliographic Citation","Dublin Core:Temporal Coverage","Dublin Core:Accrual Method","Dublin Core:Accrual Periodicity","Dublin Core:Accrual Policy","Dublin Core:Audience","Dublin Core:Audience Education Level","Dublin Core:Mediator","Dublin Core:Instructional Method","Dublin Core:Rights Holder","Item Type Metadata:Text","Item Type Metadata:Interviewer","Item Type Metadata:Interviewee","Item Type Metadata:Location","Item Type Metadata:Transcription","Item Type Metadata:URL local","Item Type Metadata:Format original","Item Type Metadata:Dimensions físiques","Item Type Metadata:Duration","Item Type Metadata:Compression","Item Type Metadata:Producer","Item Type Metadata:Director","Item Type Metadata:Bit Rate/Frequency","Item Type Metadata:Time Summary","Item Type Metadata:Email Body","Item Type Metadata:Subject Line","Item Type Metadata:From","Item Type Metadata:To","Item Type Metadata:CC","Item Type Metadata:BCC","Item Type Metadata:Number of Attachments","Item Type Metadata:Standards","Item Type Metadata:Objectives","Item Type Metadata:Materials","Item Type Metadata:Lesson Plan Text","Item Type Metadata:URL","Item Type Metadata:Event Type","Item Type Metadata:Participants","Item Type Metadata:Birth Date","Item Type Metadata:Birthplace","Item Type Metadata:Death Date","Item Type Metadata:Occupation","Item Type Metadata:Biographical Text","Item Type Metadata:Bibliography","Item Type Metadata:Edition Statement","Item Type Metadata:Publication Statement","Item Type Metadata:Note statement","Item Type Metadata:Profile description : Creation","Item Type Metadata:Profile description : Descriptive Rules","Item Type Metadata:Profile description : Language Usage","Item Type Metadata:Revision Description : Change","Item Type Metadata:Revision Description : List","Item Type Metadata:Front matter : Title page","Item Type Metadata:Front matter : Division","Item Type Metadata:Destinatari","Item Type Metadata:Número de caixa","Item Type Metadata:Localització de la caixa","EAD Archive:Level","EAD Archive:Arrangement","EAD Archive:Descriptive Identification : Heading","EAD Archive:Descriptive Identification : Note","EAD Archive:Appraisal Information","EAD Archive:Biography or History","EAD Archive:Index","EAD Archive:Note","EAD Archive:Other Descriptive Data","EAD Archive:Processing Information","EAD Archive:Scope and Content","EAD Archive:Heading","EAD Archive:Table Head","PDF Text:Text",tags,file,itemType,collection,public,featured
"Presentació del conferenciant Carlo Tognoli","Maragall, Pasqual, 1941-",,1987-10-26,Conferència,Textual,Català,Alcaldes,,,,"Saló de Cent",,"Aquest document forma part del fons municipal de l’Ajuntament de Barcelona (productor de la documentació) i és còpia digital de l’original custodiat a l’Arxiu Municipal Contemporani de Barcelona.",,,4021,,,,,,,,,,,,,,,,,,,,,,,,,,,,,,,,,,,,,,,,,,,,,,,,,,,,,,,,,,,,,,,,,,,,,,,,,,,,,,,,,,,,,,Document,,,,,,,,,,,,,,"Discursos i conferències",https://www.arxiupmaragall.catalunyaeuropa.net/files/original/30/1115/19871026d_00245.pdf,,"09.01. Activitat de representació (com a Alcalde)",1,0
"Presentació de la memòria de la campanya ""Barcelona posa't guapa""","Maragall, Pasqual, 1941-",,1993-05-04,Discurs,Textual,Català,"Administració local",,,,"Palau Nacional de Montjuïc",,"Aquest document forma part del fons municipal de l’Ajuntament de Barcelona (productor de la documentació) i és còpia digital de l’original custodiat a l’Arxiu Municipal Contemporani de Barcelona.",,,4231,,,,,,,,,,,,,,,,,,,,,,,,,,,,,,,,,,,,,,,,,,,,,,,,,,,,,,,,,,,,,,,,,,,,,,,,,,,,,,,,,,,,,,Document,,,,,,,,,,,,,,"Discursos i conferències",https://www.arxiupmaragall.catalunyaeuropa.net/files/original/30/1325/19930504d_00554.pdf,,"09.01. Activitat de representació (com a Alcalde)",1,0
"Presentació de la Candidatura de Barcelona a les Eleccions Municipals 1987","Maragall, Pasqual, 1941-",,1987-05-15,Discurs,Textual,Català,Eleccions,,,"La Tamarita. Casa de la Caritat. Ciutat Vella. Casa de la Misericòrdia. Parc Sot del Migdia.","Hotel Colon, Barcelona",,"Aquest document forma part del fons municipal de l’Ajuntament de Barcelona (productor de la documentació) i és còpia digital de l’original custodiat a l’Arxiu Municipal Contemporani de Barcelona.",,,3995,,,,,,,,,,,,,,,,,,,,,,,,,,,,,,,,,,,,,,,,,,,,,,,,,,,,,,,,,,,,,,,,,,,,,,,,,,,,,,,,,,,,,,Document,,,,,,,,,,,,,,"Discursos i conferències",https://www.arxiupmaragall.catalunyaeuropa.net/files/original/30/1089/19870515d_00210.pdf,,"09.01. Activitat de representació (com a Alcalde)",1,0
"Possibiltat, Contingut i abast d'un Estatut per a les Grans Ciutats / Conferència dins el Seminari sobre ""Problemas y perspectivas de la Autonomia Local en el cierre del diseño del Estado de las Autonomías""","Maragall, Pasqual, 1941-",,1994-09-13,Conferència,Textual,Castellà,"Administració local",,,"Els regims especials de Carta per a Madrid i Barcelona poden ser una solució per a que aquestes dos grans ciutats disposin de mecanismes jurídics necessaris. Efectivitat de les multes, retitada de permisos, padró de multes, delegar la imposició de sancions. Justicia municipal de pau la distribució territorial d'aquests òrgans i el finançament. Article 25 de la LRBRL. Carta Municipal de Barcelona.","UIMP, Santander",,"Aquest document forma part del fons municipal de l’Ajuntament de Barcelona (productor de la documentació) i és còpia digital de l’original custodiat a l’Arxiu Municipal Contemporani de Barcelona.",,,4309,,,,,,,,,,,,,,,,,,,,,,,,,,,,,,,,,,,,,,,,,,,,,,,,,,,,,,,,,,,,,,,,,,,,,,,,,,,,,,,,,,,,,,Document,,,,,,,,,,,,,,"Discursos i conferències",https://www.arxiupmaragall.catalunyaeuropa.net/files/original/30/1403/19940913d_00641_LD.pdf,,"09.01. Activitat de representació (com a Alcalde)",1,0
"Paraules de victòria en les Eleccions Municipals 1987","Maragall, Pasqual, 1941-",,1987-06-10,Discurs,Textual,Català,Socialisme,,,,"Hotel Manila, Barcelona",,"Aquest document forma part del fons municipal de l’Ajuntament de Barcelona (productor de la documentació) i és còpia digital de l’original custodiat a l’Arxiu Municipal Contemporani de Barcelona.",,,4007,,,,,,,,,,,,,,,,,,,,,,,,,,,,,,,,,,,,,,,,,,,,,,,,,,,,,,,,,,,,,,,,,,,,,,,,,,,,,,,,,,,,,,Document,,,,,,,,,,,,,,"Discursos i conferències",https://www.arxiupmaragall.catalunyaeuropa.net/files/original/30/1101/19870610d_00223.pdf,,"09.01. Activitat de representació (com a Alcalde)",1,0
"Paraules de l’Excm. Alcalde de Barcelona, sr. Pasqual Maragall, en l'acte de cloenda de la commemoració del Centenari de Carles Pi i Sunyer / Cloenda","Maragall, Pasqual, 1941-",,1988-02-29,Discurs,Textual,Català,Alcaldes,"Conté notes manuscrites de PM.",,"Tasques polítiques: Llei Municipal, Pla Macià, Carta Sanitària de Barcelona. Altres: remodelació de la Plaça del Rei, rehabilitació de les Drassanes, soterrament de la línia del ferrocarril, etc.","Saló de Cent",,"Aquest document forma part del fons municipal de l’Ajuntament de Barcelona (productor de la documentació) i és còpia digital de l’original custodiat a l’Arxiu Municipal Contemporani de Barcelona.",,,4047,,,,,,,,,,,,,,,,,,,,,,,,,,,,,,,,,,,,,,,,,,,,,,,,,,,,,,,,,,,,,,,,,,,,,,,,,,,,,,,,,,,,,,Document,,,,,,,,,,,,,,"Discursos i conferències",https://www.arxiupmaragall.catalunyaeuropa.net/files/original/30/1141/19880229d_00270.pdf,,"09.01. Activitat de representació (com a Alcalde)",1,0
"Paraules de l'Exc. Sr. Alcalde sobre la Carta Municipal","Maragall, Pasqual, 1941-",,1994-09-28,Discurs,Textual,Català,Municipis,,,,,,"Aquest document forma part del fons municipal de l’Ajuntament de Barcelona (productor de la documentació) i és còpia digital de l’original custodiat a l’Arxiu Municipal Contemporani de Barcelona.",,,4315,,,,,,,,,,,,,,,,,,,,,,,,,,,,,,,,,,,,,,,,,,,,,,,,,,,,,,,,,,,,,,,,,,,,,,,,,,,,,,,,,,,,,,Document,,,,,,,,,,,,,,"Discursos i conferències",https://www.arxiupmaragall.catalunyaeuropa.net/files/original/30/1409/19940928d_00645.pdf,,"09.01. Activitat de representació (com a Alcalde)",1,0
"Notes per la intervenció del Sr. Alcalde a la sessió de Sitges. Reunió de Coordinadors de l'Ajuntament","Maragall, Pasqual, 1941-",,1989-02-28,Discurs,Textual,Català,"Administració local",,,,Sitges,,"Aquest document forma part del fons municipal de l’Ajuntament de Barcelona (productor de la documentació) i és còpia digital de l’original custodiat a l’Arxiu Municipal Contemporani de Barcelona.",,,4091,,,,,,,,,,,,,,,,,,,,,,,,,,,,,,,,,,,,,,,,,,,,,,,,,,,,,,,,,,,,,,,,,,,,,,,,,,,,,,,,,,,,,,Document,,,,,,,,,,,,,,"Discursos i conferències",https://www.arxiupmaragall.catalunyaeuropa.net/files/original/30/1185/19890228d_00325.pdf,,"09.01. Activitat de representació (com a Alcalde)",1,0
"Micromega, local y global. DESDE ROMA","Maragall, Pasqual, 1941-",,1997-11-28,Article,Textual,Castellà,Globalització,,"La Vanguardia",,,,,,,1190,,,,,,,,,,,,,,,,,,,,,,,,,,,,,,,,,,,,,,,,,,,,,,,,,,,,,,,,,,,,,,,,,,,,,,,,,,,,,,,,,,,,,,Document,,,"Activitat professional",,,,,,,,,,,Articles,https://www.arxiupmaragall.catalunyaeuropa.net/files/original/8/728/19971128_LV.pdf,,"02. Activitat professional",1,0
"Los ciudadanos en las urbes del año 2000 / Ponència dins el Seminari ""España en el umbral del siglo XXI, Reflexiones sobre un futuro que ya es presente""","Maragall, Pasqual, 1941-",,1985-11-08,Discurs,Textual,Castellà,"Administració local",,,,"Facultat d'Econòmiques",,"Aquest document forma part del fons municipal de l’Ajuntament de Barcelona (productor de la documentació) i és còpia digital de l’original custodiat a l’Arxiu Municipal Contemporani de Barcelona.",,,3898,,,,,,,,,,,,,,,,,,,,,,,,,,,,,,,,,,,,,,,,,,,,,,,,,,,,,,,,,,,,,,,,,,,,,,,,,,,,,,,,,,,,,,Document,,,,,,,,,,,,,,"Discursos i conferències",https://www.arxiupmaragall.catalunyaeuropa.net/files/original/30/992/19851108d_00090.pdf,,"09.01. Activitat de representació (com a Alcalde)",1,0
