﻿"Dublin Core:Title","Dublin Core:Creator","Dublin Core:Contributor","Dublin Core:Date","Dublin Core:Type","Dublin Core:Format","Dublin Core:Language","Dublin Core:Subject","Dublin Core:Description","Dublin Core:Source","Dublin Core:Abstract","Dublin Core:Spatial Coverage","Dublin Core:Publisher","Dublin Core:Provenance","Dublin Core:Rights","Dublin Core:Relation","Dublin Core:Identifier","Dublin Core:Coverage","Dublin Core:Alternative Title","Dublin Core:Table Of Contents","Dublin Core:Date Available","Dublin Core:Date Created","Dublin Core:Date Accepted","Dublin Core:Date Copyrighted","Dublin Core:Date Submitted","Dublin Core:Date Issued","Dublin Core:Date Modified","Dublin Core:Date Valid","Dublin Core:Access Rights","Dublin Core:License","Dublin Core:Conforms To","Dublin Core:Has Format","Dublin Core:Has Part","Dublin Core:Has Version","Dublin Core:Is Format Of","Dublin Core:Is Part Of","Dublin Core:Is Referenced By","Dublin Core:Is Replaced By","Dublin Core:Is Required By","Dublin Core:Is Version Of","Dublin Core:References","Dublin Core:Replaces","Dublin Core:Requires","Dublin Core:Extent","Dublin Core:Medium","Dublin Core:Bibliographic Citation","Dublin Core:Temporal Coverage","Dublin Core:Accrual Method","Dublin Core:Accrual Periodicity","Dublin Core:Accrual Policy","Dublin Core:Audience","Dublin Core:Audience Education Level","Dublin Core:Mediator","Dublin Core:Instructional Method","Dublin Core:Rights Holder","Item Type Metadata:Text","Item Type Metadata:Interviewer","Item Type Metadata:Interviewee","Item Type Metadata:Location","Item Type Metadata:Transcription","Item Type Metadata:URL local","Item Type Metadata:Format original","Item Type Metadata:Dimensions físiques","Item Type Metadata:Duration","Item Type Metadata:Compression","Item Type Metadata:Producer","Item Type Metadata:Director","Item Type Metadata:Bit Rate/Frequency","Item Type Metadata:Time Summary","Item Type Metadata:Email Body","Item Type Metadata:Subject Line","Item Type Metadata:From","Item Type Metadata:To","Item Type Metadata:CC","Item Type Metadata:BCC","Item Type Metadata:Number of Attachments","Item Type Metadata:Standards","Item Type Metadata:Objectives","Item Type Metadata:Materials","Item Type Metadata:Lesson Plan Text","Item Type Metadata:URL","Item Type Metadata:Event Type","Item Type Metadata:Participants","Item Type Metadata:Birth Date","Item Type Metadata:Birthplace","Item Type Metadata:Death Date","Item Type Metadata:Occupation","Item Type Metadata:Biographical Text","Item Type Metadata:Bibliography","Item Type Metadata:Edition Statement","Item Type Metadata:Publication Statement","Item Type Metadata:Note statement","Item Type Metadata:Profile description : Creation","Item Type Metadata:Profile description : Descriptive Rules","Item Type Metadata:Profile description : Language Usage","Item Type Metadata:Revision Description : Change","Item Type Metadata:Revision Description : List","Item Type Metadata:Front matter : Title page","Item Type Metadata:Front matter : Division","Item Type Metadata:Destinatari","Item Type Metadata:Número de caixa","Item Type Metadata:Localització de la caixa","EAD Archive:Level","EAD Archive:Arrangement","EAD Archive:Descriptive Identification : Heading","EAD Archive:Descriptive Identification : Note","EAD Archive:Appraisal Information","EAD Archive:Biography or History","EAD Archive:Index","EAD Archive:Note","EAD Archive:Other Descriptive Data","EAD Archive:Processing Information","EAD Archive:Scope and Content","EAD Archive:Heading","EAD Archive:Table Head","PDF Text:Text",tags,file,itemType,collection,public,featured
"Roda de premsa de Pasqual Maragall a l'Hospital de Sant Pau","Maragall, Pasqual, 1941-",,2007-10-20,Declaracions,Textual,Català,Alzheimer,"Declaració pública del diagnòstic d'un principi d'Alzheimer.",,"Paraules de Pasqual Maragall anunciant en roda de premsa el diagnòstic recent d'un principi d'Alzheimer.","Hospital de Sant Pau (Barcelona)",,,,,,,,,,,,,,,,,,,,,,,,,,,,,,,,,,,,,,,,,,,,,,,,,,,,,,,,,,,,,,,,,,,,,,,,,,,,,,,,,,,,,,,,,,,Document,,,,,,,,,,,,,,"Discursos i conferències",https://www.arxiupmaragall.catalunyaeuropa.net/files/original/21/916/0000000864.pdf,Text,"13. Expresident de la Generalitat de Catalunya",1,0
"Contra ‘Eisenhower’","Maragall, Pasqual, 1941-",,2007-10-21,Article,Textual,Castellà,Alzheimer,,"El País",,,,,,,1535,,,,,,,,,,,,,,,,,,,,,,,,,,,,,,,,,,,,,,,,,,,,,,,,,,,,,,,,,,,,,,,,,,,,,,,,,,,,,,,,,,,,,,Document,,,,,,,,,,,,,,Articles,https://www.arxiupmaragall.catalunyaeuropa.net/files/original/21/884/0000000810.pdf,,"13. Expresident de la Generalitat de Catalunya",1,0
"Bona salut política","Maragall, Pasqual, 1941-",,2007-10-22,Article,Textual,Català,Salut,,"El Periódico de Catalunya",,,,,,,1534,,,,,,,,,,,,,,,,,,,,,,,,,,,,,,,,,,,,,,,,,,,,,,,,,,,,,,,,,,,,,,,,,,,,,,,,,,,,,,,,,,,,,,Document,,,,,,,,,,,,,,Articles,https://www.arxiupmaragall.catalunyaeuropa.net/files/original/21/1710/0000000811.pdf,,"13. Expresident de la Generalitat de Catalunya",1,0
"Presentació del documental “Bucarest. La memòria perduda” d’Albert Solé, sobre Jordi Solé Tura","Maragall, Pasqual, 1941-",,2008-01-14,Discurs,Textual,Català,"Solé-Tura, Jordi, 1930-2009",,,"Discurs de Pasqual Maragall a la presentació del documental d'Albert Solé, ""Bucarest. La memòria perduda"", sobre el seu pare Jordi Solé Tura.","CCCB (Barcelona)",,,,,,,,,,,,,,,,,,,,,,,,,,,,,,,,,,,,,,,,,,,,,,,,,,,,,,,,,,,,,,,,,,,,,,,,,,,,,,,,,,,,,,,,,,,Document,,,,,,,,,,,,,,"Discursos i conferències",https://www.arxiupmaragall.catalunyaeuropa.net/files/original/21/923/0000000915.pdf,,"13. Expresident de la Generalitat de Catalunya",1,0
"Un nou paisatge després de les eleccions","Maragall, Pasqual, 1941-",,2008-03-14,Article,Textual,Català,Eleccions,,"El Periódico de Catalunya",,,,,,,,,,,,,,,,,,,,,,,,,,,,,,,,,,,,,,,,,,,,,,,,,,,,,,,,,,,,,,,,,,,,,,,,,,,,,,,,,,,,,,,,,,,,,Document,,,,,,,,,,,,,,Articles,https://www.arxiupmaragall.catalunyaeuropa.net/files/original/21/1720/0000000926.pdf,,"13. Expresident de la Generalitat de Catalunya",1,0
"Deixeu-me donar les gràcies","Maragall, Pasqual, 1941-",,2008-04-04,Article,Textual,Català,Alzheimer,,"El Periódico de Catalunya","Agraïment per la distinció Català de l'Any 2007.",,,,,,,,,,,,,,,,,,,,,,,,,,,,,,,,,,,,,,,,,,,,,,,,,,,,,,,,,,,,,,,,,,,,,,,,,,,,,,,,,,,,,,,,,,,,Document,,,,,,,,,,,,,,Articles,https://www.arxiupmaragall.catalunyaeuropa.net/files/original/21/1719/0000000930.pdf,,"13. Expresident de la Generalitat de Catalunya",1,0
"¡Qué baño! ¡Qué chaparrón! ¡Qué noche!","Maragall, Pasqual, 1941-",,2008-05-09,Article,Textual,Castellà,Esports,,"El País",,,,,,,4444,,,,,,,,,,,,,,,,,,,,,,,,,,,,,,,,,,,,,,,,,,,,,,,,,,,,,,,,,,,,,,,,,,,,,,,,,,,,,,,,,,,,,,Document,,,,,,,,,,,,,,Articles,https://www.arxiupmaragall.catalunyaeuropa.net/files/original/21/886/0000000942.pdf,,"13. Expresident de la Generalitat de Catalunya",1,0
"Presentació de la Fundació Pasqual Maragall","Maragall, Pasqual, 1941-",,2008-06-19,Discurs,Textual,Català,Alzheimer,,,,"Teatre Nacional de Catalunya",,,,,,,,,,,,,,,,,,,,,,,,,,,,,,,,,,,,,,,,,,,,,,,,,,,,,,,,,,,,,,,,,,,,,,,,,,,,,,,,,,,,,,,,,,,Document,,,,,,,,,,,,,,"Discursos i conferències",https://www.arxiupmaragall.catalunyaeuropa.net/files/original/21/2698/PARAULES_FPM_19_juny.pdf,,"13. Expresident de la Generalitat de Catalunya",1,0
"L'alzheimer només es pot afrontar en companyia. Un sol no pot","Maragall, Pasqual, 1941-",,2008-09-07,Entrevista,Textual,Català,Alzheimer,,"Diari de Girona",,,,,,,,,,,,,,,,,,,,,,,,,,,,,,,,,,,,,,,,,,,,,,,,,,,,,,,,,,,,,,,,,,,,,,,,,,,,,,,,,,,,,,,,,,,,,Document,,,,,,,,,,,,,,Entrevistes,https://www.arxiupmaragall.catalunyaeuropa.net/files/original/21/1647/0000000959.pdf,,"13. Expresident de la Generalitat de Catalunya",1,0
"Maragall, la malattia la memoria e la politica","Maragall, Pasqual, 1941-",,2008-09-12,Entrevista,Textual,Italià,Alzheimer,,L'Unità,,,,,,,,,,,,,,,,,,,,,,,,,,,,,,,,,,,,,,,,,,,,,,,,,,,,,,,,,,,,,,,,,,,,,,,,,,,,,,,,,,,,,,,,,,,,,Document,,,,,,,,,,,,,,Entrevistes,https://www.arxiupmaragall.catalunyaeuropa.net/files/original/21/1648/0000000954.pdf,,"13. Expresident de la Generalitat de Catalunya",1,0
