﻿"Dublin Core:Title","Dublin Core:Creator","Dublin Core:Contributor","Dublin Core:Date","Dublin Core:Type","Dublin Core:Format","Dublin Core:Language","Dublin Core:Subject","Dublin Core:Description","Dublin Core:Source","Dublin Core:Abstract","Dublin Core:Spatial Coverage","Dublin Core:Publisher","Dublin Core:Provenance","Dublin Core:Rights","Dublin Core:Relation","Dublin Core:Identifier","Dublin Core:Coverage","Dublin Core:Alternative Title","Dublin Core:Table Of Contents","Dublin Core:Date Available","Dublin Core:Date Created","Dublin Core:Date Accepted","Dublin Core:Date Copyrighted","Dublin Core:Date Submitted","Dublin Core:Date Issued","Dublin Core:Date Modified","Dublin Core:Date Valid","Dublin Core:Access Rights","Dublin Core:License","Dublin Core:Conforms To","Dublin Core:Has Format","Dublin Core:Has Part","Dublin Core:Has Version","Dublin Core:Is Format Of","Dublin Core:Is Part Of","Dublin Core:Is Referenced By","Dublin Core:Is Replaced By","Dublin Core:Is Required By","Dublin Core:Is Version Of","Dublin Core:References","Dublin Core:Replaces","Dublin Core:Requires","Dublin Core:Extent","Dublin Core:Medium","Dublin Core:Bibliographic Citation","Dublin Core:Temporal Coverage","Dublin Core:Accrual Method","Dublin Core:Accrual Periodicity","Dublin Core:Accrual Policy","Dublin Core:Audience","Dublin Core:Audience Education Level","Dublin Core:Mediator","Dublin Core:Instructional Method","Dublin Core:Rights Holder","Item Type Metadata:Text","Item Type Metadata:Interviewer","Item Type Metadata:Interviewee","Item Type Metadata:Location","Item Type Metadata:Transcription","Item Type Metadata:URL local","Item Type Metadata:Format original","Item Type Metadata:Dimensions físiques","Item Type Metadata:Duration","Item Type Metadata:Compression","Item Type Metadata:Producer","Item Type Metadata:Director","Item Type Metadata:Bit Rate/Frequency","Item Type Metadata:Time Summary","Item Type Metadata:Email Body","Item Type Metadata:Subject Line","Item Type Metadata:From","Item Type Metadata:To","Item Type Metadata:CC","Item Type Metadata:BCC","Item Type Metadata:Number of Attachments","Item Type Metadata:Standards","Item Type Metadata:Objectives","Item Type Metadata:Materials","Item Type Metadata:Lesson Plan Text","Item Type Metadata:URL","Item Type Metadata:Event Type","Item Type Metadata:Participants","Item Type Metadata:Birth Date","Item Type Metadata:Birthplace","Item Type Metadata:Death Date","Item Type Metadata:Occupation","Item Type Metadata:Biographical Text","Item Type Metadata:Bibliography","Item Type Metadata:Edition Statement","Item Type Metadata:Publication Statement","Item Type Metadata:Note statement","Item Type Metadata:Profile description : Creation","Item Type Metadata:Profile description : Descriptive Rules","Item Type Metadata:Profile description : Language Usage","Item Type Metadata:Revision Description : Change","Item Type Metadata:Revision Description : List","Item Type Metadata:Front matter : Title page","Item Type Metadata:Front matter : Division","Item Type Metadata:Destinatari","Item Type Metadata:Número de caixa","Item Type Metadata:Localització de la caixa","EAD Archive:Level","EAD Archive:Arrangement","EAD Archive:Descriptive Identification : Heading","EAD Archive:Descriptive Identification : Note","EAD Archive:Appraisal Information","EAD Archive:Biography or History","EAD Archive:Index","EAD Archive:Note","EAD Archive:Other Descriptive Data","EAD Archive:Processing Information","EAD Archive:Scope and Content","EAD Archive:Heading","EAD Archive:Table Head","PDF Text:Text",tags,file,itemType,collection,public,featured
"Conferència ""Respetar identidades, compartir proyectos"", a la Fundació Caixa Galicia","Maragall, Pasqual, 1941-",,2006-02-02,Conferència,Textual,Castellà,Autonomia,,,,"Santiago de Compostela",,"Aquest document és còpia digital de l'original custodiat a l'Arxiu Nacional de Catalunya.",,,1732,,,,,,,,,,,,,,,,,,,,,,,,,,,,,,,,,,,,,,,,,,,,,,,,,,,,,,,,,,,,,,,,,,,,,,,,,,,,,,,,,,,,,,Document,,,,,,,,,,,,,,"Discursos i conferències",https://www.arxiupmaragall.catalunyaeuropa.net/files/original/27/250/20060202.pdf,Text,"12.01. Activitat de representació (com a President)",1,0
"Conferència de Cloenda del Cicle de Conferències Barcelona Solidària","Maragall, Pasqual, 1941-",,1986-11-04,Conferència,Textual,Català,Federalisme,,,"Sumari de la conferència: - Espanya i Catalunya. - 1992. - La immigració a Barcelona. - Problemes de finançament. - Solidaritat metropolitna. - Una reflexió personal.","Saló de Cent",,"Aquest document forma part del fons municipal de l’Ajuntament de Barcelona (productor de la documentació) i és còpia digital de l’original custodiat a l’Arxiu Municipal Contemporani de Barcelona.",,,4443,,,,,,,,,,,,,,,,,,,,,,,,,,,,,,,,,,,,,,,,,,,,,,,,,,,,,,,,,,,,,,,,,,,,,,,,,,,,,,,,,,,,,,Document,,,,,,,,,,,,,,"Discursos i conferències",https://www.arxiupmaragall.catalunyaeuropa.net/files/original/30/1537/19860411d_0028.pdf,,"09.01. Activitat de representació (com a Alcalde)",1,0
"Conferencia de Copenhague en motivo del décimo aniversario de la Carta Europea de la Autonomia Local","Maragall, Pasqual, 1941-",,1996-04-18,Conferència,Textual,Castellà,"Administració local",,,,Copenhague,,"Aquest document forma part del fons municipal de l’Ajuntament de Barcelona (productor de la documentació) i és còpia digital de l’original custodiat a l’Arxiu Municipal Contemporani de Barcelona.",,,4388,,,,,,,,,,,,,,,,,,,,,,,,,,,,,,,,,,,,,,,,,,,,,,,,,,,,,,,,,,,,,,,,,,,,,,,,,,,,,,,,,,,,,,Document,,,,,,,,,,,,,,"Discursos i conferències",https://www.arxiupmaragall.catalunyaeuropa.net/files/original/30/1482/19960418d_00721.pdf,,"09.01. Activitat de representació (com a Alcalde)",1,0
"Conferència del president de la Generalitat, Pasqual Maragall, a la New York University (anglès)","Maragall, Pasqual, 1941-",,2006-02-22,Conferència,Textual,Anglès,Autonomia,,,,"Nova York",,"Aquest document és còpia digital de l'original custodiat a l'Arxiu Nacional de Catalunya.",,,1735,,,,,,,,,,,,,,,,,,,,,,,,,,,,,,,,,,,,,,,,,,,,,,,,,,,,,,,,,,,,,,,,,,,,,,,,,,,,,,,,,,,,,,Document,,,,,,,,,,,,,,"Discursos i conferències",https://www.arxiupmaragall.catalunyaeuropa.net/files/original/27/253/20060222.pdf,Text,"12.01. Activitat de representació (com a President)",1,0
"Conferencia pronunciada por el Alcalde de Barcelona en la clausura del ciclo ""Barcelona Solidària"", Excm. Sr. D. Pasqual Maragall i Mira","Maragall, Pasqual, 1941-",,1987-01-06,Conferència,Textual,Castellà,Catalanisme,,,,"Saló de Cent",,"Aquest document forma part del fons municipal de l’Ajuntament de Barcelona (productor de la documentació) i és còpia digital de l’original custodiat a l’Arxiu Municipal Contemporani de Barcelona.",,,3977,,,,,,,,,,,,,,,,,,,,,,,,,,,,,,,,,,,,,,,,,,,,,,,,,,,,,,,,,,,,,,,,,,,,,,,,,,,,,,,,,,,,,,Document,,,,,,,,,,,,,,"Discursos i conferències",https://www.arxiupmaragall.catalunyaeuropa.net/files/original/30/1071/19870106d_00186.pdf,,"09.01. Activitat de representació (com a Alcalde)",1,0
"Conferència sobre la carta europea d'autonomia local","Maragall, Pasqual, 1941-",,1997-04-24,Conferència,Textual,Català,"Administració local",,,,"Saló de Cent",,"Aquest document forma part del fons municipal de l’Ajuntament de Barcelona (productor de la documentació) i és còpia digital de l’original custodiat a l’Arxiu Municipal Contemporani de Barcelona.",,,4423,,,,,,,,,,,,,,,,,,,,,,,,,,,,,,,,,,,,,,,,,,,,,,,,,,,,,,,,,,,,,,,,,,,,,,,,,,,,,,,,,,,,,,Document,,,,,,,,,,,,,,"Discursos i conferències",https://www.arxiupmaragall.catalunyaeuropa.net/files/original/30/1517/19970424d_00759.pdf,,"09.01. Activitat de representació (com a Alcalde)",1,0
"Declaració del president de la Generalitat amb motiu de la Diada de Sant Jordi 2006","Maragall, Pasqual, 1941-",,2006-04-23,Declaracions,Textual,Català,Autogovern,,,,"Palau de Pedralbes",,"Aquest document és còpia digital de l'original custodiat a l'Arxiu Nacional de Catalunya.",,,1746,,,,,,,,,,,,,,,,,,,,,,,,,,,,,,,,,,,,,,,,,,,,,,,,,,,,,,,,,,,,,,,,,,,,,,,,,,,,,,,,,,,,,,Document,,,,,,,,,,,,,,"Discursos i conferències",https://www.arxiupmaragall.catalunyaeuropa.net/files/original/27/264/20060423.pdf,Text,"12.01. Activitat de representació (com a President)",1,0
"Declaració del president de la Generalitat després de l'aprovació de l'Estatut d'autonomia de Catalunya","Maragall, Pasqual, 1941-",,2006-06-18,Declaracions,Textual,Català,Autonomia,,,,"Palau de la Generalitat",,"Aquest document és còpia digital de l'original custodiat a l'Arxiu Nacional de Catalunya.",,,1760,,,,,,,,,,,,,,,,,,,,,,,,,,,,,,,,,,,,,,,,,,,,,,,,,,,,,,,,,,,,,,,,,,,,,,,,,,,,,,,,,,,,,,Document,,,,,,,,,,,,,,"Discursos i conferències",https://www.arxiupmaragall.catalunyaeuropa.net/files/original/27/279/20060618.pdf,Text,"12.01. Activitat de representació (com a President)",1,0
"Declaració després de l'aprovació de l'Estatut de Catalunya al Congrés dels Diputats","Maragall, Pasqual, 1941-",,2006-03-20,Declaracions,Textual,Català,Autonomia,,,,"Congrés dels Diputats. Madrid",,"Aquest document és còpia digital de l'original custodiat a l'Arxiu Nacional de Catalunya.",,,1743,,,,,,,,,,,,,,,,,,,,,,,,,,,,,,,,,,,,,,,,,,,,,,,,,,,,,,,,,,,,,,,,,,,,,,,,,,,,,,,,,,,,,,Document,,,,,,,,,,,,,,"Discursos i conferències",https://www.arxiupmaragall.catalunyaeuropa.net/files/original/27/261/20060330.pdf,Text,"12.01. Activitat de representació (com a President)",1,0
"Declaració en relació a l'aprovació de l'Estatut en ponència","Maragall, Pasqual, 1941-",,2005-07-08,Declaracions,Textual,Català,Autonomia,,,,"Palau de la Generalitat",,"Aquest document és còpia digital de l'original custodiat a l'Arxiu Nacional de Catalunya.",,,1691,,,,,,,,,,,,,,,,,,,,,,,,,,,,,,,,,,,,,,,,,,,,,,,,,,,,,,,,,,,,,,,,,,,,,,,,,,,,,,,,,,,,,,Document,,,,,,,,,,,,,,"Discursos i conferències",https://www.arxiupmaragall.catalunyaeuropa.net/files/original/27/209/20050708.pdf,Text,"12.01. Activitat de representació (com a President)",1,0
