﻿"Dublin Core:Title","Dublin Core:Creator","Dublin Core:Contributor","Dublin Core:Date","Dublin Core:Type","Dublin Core:Format","Dublin Core:Language","Dublin Core:Subject","Dublin Core:Description","Dublin Core:Source","Dublin Core:Abstract","Dublin Core:Spatial Coverage","Dublin Core:Publisher","Dublin Core:Provenance","Dublin Core:Rights","Dublin Core:Relation","Dublin Core:Identifier","Dublin Core:Coverage","Dublin Core:Alternative Title","Dublin Core:Table Of Contents","Dublin Core:Date Available","Dublin Core:Date Created","Dublin Core:Date Accepted","Dublin Core:Date Copyrighted","Dublin Core:Date Submitted","Dublin Core:Date Issued","Dublin Core:Date Modified","Dublin Core:Date Valid","Dublin Core:Access Rights","Dublin Core:License","Dublin Core:Conforms To","Dublin Core:Has Format","Dublin Core:Has Part","Dublin Core:Has Version","Dublin Core:Is Format Of","Dublin Core:Is Part Of","Dublin Core:Is Referenced By","Dublin Core:Is Replaced By","Dublin Core:Is Required By","Dublin Core:Is Version Of","Dublin Core:References","Dublin Core:Replaces","Dublin Core:Requires","Dublin Core:Extent","Dublin Core:Medium","Dublin Core:Bibliographic Citation","Dublin Core:Temporal Coverage","Dublin Core:Accrual Method","Dublin Core:Accrual Periodicity","Dublin Core:Accrual Policy","Dublin Core:Audience","Dublin Core:Audience Education Level","Dublin Core:Mediator","Dublin Core:Instructional Method","Dublin Core:Rights Holder","Item Type Metadata:Text","Item Type Metadata:Interviewer","Item Type Metadata:Interviewee","Item Type Metadata:Location","Item Type Metadata:Transcription","Item Type Metadata:URL local","Item Type Metadata:Format original","Item Type Metadata:Dimensions físiques","Item Type Metadata:Duration","Item Type Metadata:Compression","Item Type Metadata:Producer","Item Type Metadata:Director","Item Type Metadata:Bit Rate/Frequency","Item Type Metadata:Time Summary","Item Type Metadata:Email Body","Item Type Metadata:Subject Line","Item Type Metadata:From","Item Type Metadata:To","Item Type Metadata:CC","Item Type Metadata:BCC","Item Type Metadata:Number of Attachments","Item Type Metadata:Standards","Item Type Metadata:Objectives","Item Type Metadata:Materials","Item Type Metadata:Lesson Plan Text","Item Type Metadata:URL","Item Type Metadata:Event Type","Item Type Metadata:Participants","Item Type Metadata:Birth Date","Item Type Metadata:Birthplace","Item Type Metadata:Death Date","Item Type Metadata:Occupation","Item Type Metadata:Biographical Text","Item Type Metadata:Bibliography","Item Type Metadata:Edition Statement","Item Type Metadata:Publication Statement","Item Type Metadata:Note statement","Item Type Metadata:Profile description : Creation","Item Type Metadata:Profile description : Descriptive Rules","Item Type Metadata:Profile description : Language Usage","Item Type Metadata:Revision Description : Change","Item Type Metadata:Revision Description : List","Item Type Metadata:Front matter : Title page","Item Type Metadata:Front matter : Division","Item Type Metadata:Destinatari","Item Type Metadata:Número de caixa","Item Type Metadata:Localització de la caixa","EAD Archive:Level","EAD Archive:Arrangement","EAD Archive:Descriptive Identification : Heading","EAD Archive:Descriptive Identification : Note","EAD Archive:Appraisal Information","EAD Archive:Biography or History","EAD Archive:Index","EAD Archive:Note","EAD Archive:Other Descriptive Data","EAD Archive:Processing Information","EAD Archive:Scope and Content","EAD Archive:Heading","EAD Archive:Table Head","PDF Text:Text",tags,file,itemType,collection,public,featured
"És un error votar sí o no a Europa en termes de distanciament nacional d'Espanya","Sanchis, Vicent",,2004-09-11,Entrevista,Textual,Català,Europa,,Avui,,,,,,,,,,,,,,,,,,,,,,,,,,,,,,,,,,,,,,,,,,,,,,,,,,,,,,,,,,,,,,,,,,,,,,,,,,,,,,,,,,,,,,,,,,,,,Document,,,,,,,,,,,,,,Entrevistes,https://www.arxiupmaragall.catalunyaeuropa.net/files/original/27/1594/0000000757.pdf,,"12.01. Activitat de representació (com a President)",1,0
"Espanya després de les reformes estatutàries","Maragall, Pasqual, 1941-",,2007-07-18,Conferència,Textual,Català,Espanya,,,"Intervenció la taula rodona “Espanya després de les reformes estatutàries” a la Universitat d’Estiu de Gandia. Transcripció literal de la part disponible (incomplet).","Gandia (València)",,,,,,,,,,,,,,,,,,,,,,,,,,,,,,,,,,,,,,,,,,,,,,,,,,,,,,,,,,,,,,,,,,,,,,,,,,,,,,,,,,,,,,,,,,,Document,,,,,,,,,,,,,,"Discursos i conferències",https://www.arxiupmaragall.catalunyaeuropa.net/files/original/21/906/0000000675.pdf,Text,"13. Expresident de la Generalitat de Catalunya",1,0
"Estamos hablando a España y tememos que no nos oiga","Zarzalejos, José Antonio",,2004-07-11,Entrevista,Textual,Castellà,Estatut,,ABC,,,,,,,,,,,,,,,,,,,,,,,,,,,,,,,,,,,,,,,,,,,,,,,,,,,,,,,,,,,,,,,,,,,,,,,,,,,,,,,,,,,,,,,,,,,,,Document,,,,,,,,,,,,,,Entrevistes,https://www.arxiupmaragall.catalunyaeuropa.net/files/original/27/1586/0000000749.pdf,,"12.01. Activitat de representació (com a President)",1,0
"Estatut i Constitució, les reformes estatutàries i l’articulació territorial de l’Estat","Maragall, Pasqual, 1941-",,2007-09-19,Conferència,Textual,Català,Estatut,,,"XIV Jornades de l’Associació Espanyola de Lletrats de Parlaments","Parlament de Catalunya",,,,,,,,,,,,,,,,,,,,,,,,,,,,,,,,,,,,,,,,,,,,,,,,,,,,,,,,,,,,,,,,,,,,,,,,,,,,,,,,,,,,,,,,,,,Document,,,,,,,,,,,,,,"Discursos i conferències",https://www.arxiupmaragall.catalunyaeuropa.net/files/original/21/912/0000000680.pdf,Text,"13. Expresident de la Generalitat de Catalunya",1,0
"Euskadi mañana","Maragall, Pasqual, 1941-",,2000-02-27,Article,Textual,Castellà,"Buesa Blanco, Fernando",,"La Vanguardia",,,,,,,1215,,,,,,,,,,,,,,,,,,,,,,,,,,,,,,,,,,,,,,,,,,,,,,,,,,,,,,,,,,,,,,,,,,,,,,,,,,,,,,,,,,,,,,Document,,,"Activitat política",,,,,,,,,,,Articles,https://www.arxiupmaragall.catalunyaeuropa.net/files/original/23/752/20000227_LV.pdf,,"04.02. Activitat política",1,0
"Fragments de l'entrevista a Pasqual Maragall","Maragall, Pasqual, 1941-",,2001-02-19,Entrevista,Textual,Català,"País Basc",,Avui,,,,,,,,,,,,,,,,,,,,,,,,,,,,,,,,,,,,,,,,,,,,,,,,,,,,,,,,,,,,,,,,,,,,,,,,,,,,,,,,,,,,,,,,,,,,,Document,,,,,,,,,,,,,,Entrevistes,https://www.arxiupmaragall.catalunyaeuropa.net/files/original/23/1542/0000000607.pdf,,"04.02. Activitat política",1,0
"Jo no estaré mai tan lligat al nacionalisme espanyol com ho estan avui els nacionalistes catalans","Carrasco, Raimon",,2003-03-28,Entrevista,Textual,Català,Federalisme,,"Debat nacionalista",,,,,,,,,,,,,,,,,,,,,,,,,,,,,,,,,,,,,,,,,,,,,,,,,,,,,,,,,,,,,,,,,,,,,,,,,,,,,,,,,,,,,,,,,,,,,Document,,,,,,,,,,,,,,Entrevistes,https://www.arxiupmaragall.catalunyaeuropa.net/files/original/23/1564/0000000799.pdf,,"04.02. Activitat política",1,0
"Maragall dice que volveremos al 36 si no se aceptan sus teorías","Gabilondo, Iñaki",,2004-02-03,Entrevista,Textual,Castellà,"Espanya plural","Transcripció parcial de l'entrevista al programa ""Hoy por hoy"" de Cadena Ser.","La Razón",,,,,,,,,,,,,,,,,,,,,,,,,,,,,,,,,,,,,,,,,,,,,,,,,,,,,,,,,,,,,,,,,,,,,,,,,,,,,,,,,,,,,,,,,,,,,Document,,,,,,,,,,,,,,Entrevistes,https://www.arxiupmaragall.catalunyaeuropa.net/files/original/27/1573/0000000737.pdf,,"12.01. Activitat de representació (com a President)",1,0
"Maragall plantea abordar en serio la evolución constitucional de España","Noceda, Miguel Ángel",,2002-08-30,Entrevista,Textual,Castellà,Constitució,,"El País",,,,,,,,,,,,,,,,,,,,,,,,,,,,,,,,,,,,,,,,,,,,,,,,,,,,,,,,,,,,,,,,,,,,,,,,,,,,,,,,,,,,,,,,,,,,,Document,,,,,,,,,,,,,,Entrevistes,https://www.arxiupmaragall.catalunyaeuropa.net/files/original/23/1558/0000000730.pdf,,"04.02. Activitat política",1,0
"No sacrificaré la ambición del Estatut en aras del consenso","Antich, José",,2004-12-19,Entrevista,Textual,Castellà,Estatut,,"La Vanguardia",,,,,,,,,,,,,,,,,,,,,,,,,,,,,,,,,,,,,,,,,,,,,,,,,,,,,,,,,,,,,,,,,,,,,,,,,,,,,,,,,,,,,,,,,,,,,Document,,,,,,,,,,,,,,Entrevistes,https://www.arxiupmaragall.catalunyaeuropa.net/files/original/27/1598/0000000761.pdf,,"12.01. Activitat de representació (com a President)",1,0
