﻿"Dublin Core:Title","Dublin Core:Creator","Dublin Core:Contributor","Dublin Core:Date","Dublin Core:Type","Dublin Core:Format","Dublin Core:Language","Dublin Core:Subject","Dublin Core:Description","Dublin Core:Source","Dublin Core:Abstract","Dublin Core:Spatial Coverage","Dublin Core:Publisher","Dublin Core:Provenance","Dublin Core:Rights","Dublin Core:Relation","Dublin Core:Identifier","Dublin Core:Coverage","Dublin Core:Alternative Title","Dublin Core:Table Of Contents","Dublin Core:Date Available","Dublin Core:Date Created","Dublin Core:Date Accepted","Dublin Core:Date Copyrighted","Dublin Core:Date Submitted","Dublin Core:Date Issued","Dublin Core:Date Modified","Dublin Core:Date Valid","Dublin Core:Access Rights","Dublin Core:License","Dublin Core:Conforms To","Dublin Core:Has Format","Dublin Core:Has Part","Dublin Core:Has Version","Dublin Core:Is Format Of","Dublin Core:Is Part Of","Dublin Core:Is Referenced By","Dublin Core:Is Replaced By","Dublin Core:Is Required By","Dublin Core:Is Version Of","Dublin Core:References","Dublin Core:Replaces","Dublin Core:Requires","Dublin Core:Extent","Dublin Core:Medium","Dublin Core:Bibliographic Citation","Dublin Core:Temporal Coverage","Dublin Core:Accrual Method","Dublin Core:Accrual Periodicity","Dublin Core:Accrual Policy","Dublin Core:Audience","Dublin Core:Audience Education Level","Dublin Core:Mediator","Dublin Core:Instructional Method","Dublin Core:Rights Holder","Item Type Metadata:Text","Item Type Metadata:Interviewer","Item Type Metadata:Interviewee","Item Type Metadata:Location","Item Type Metadata:Transcription","Item Type Metadata:URL local","Item Type Metadata:Format original","Item Type Metadata:Dimensions físiques","Item Type Metadata:Duration","Item Type Metadata:Compression","Item Type Metadata:Producer","Item Type Metadata:Director","Item Type Metadata:Bit Rate/Frequency","Item Type Metadata:Time Summary","Item Type Metadata:Email Body","Item Type Metadata:Subject Line","Item Type Metadata:From","Item Type Metadata:To","Item Type Metadata:CC","Item Type Metadata:BCC","Item Type Metadata:Number of Attachments","Item Type Metadata:Standards","Item Type Metadata:Objectives","Item Type Metadata:Materials","Item Type Metadata:Lesson Plan Text","Item Type Metadata:URL","Item Type Metadata:Event Type","Item Type Metadata:Participants","Item Type Metadata:Birth Date","Item Type Metadata:Birthplace","Item Type Metadata:Death Date","Item Type Metadata:Occupation","Item Type Metadata:Biographical Text","Item Type Metadata:Bibliography","Item Type Metadata:Edition Statement","Item Type Metadata:Publication Statement","Item Type Metadata:Note statement","Item Type Metadata:Profile description : Creation","Item Type Metadata:Profile description : Descriptive Rules","Item Type Metadata:Profile description : Language Usage","Item Type Metadata:Revision Description : Change","Item Type Metadata:Revision Description : List","Item Type Metadata:Front matter : Title page","Item Type Metadata:Front matter : Division","Item Type Metadata:Destinatari","Item Type Metadata:Número de caixa","Item Type Metadata:Localització de la caixa","EAD Archive:Level","EAD Archive:Arrangement","EAD Archive:Descriptive Identification : Heading","EAD Archive:Descriptive Identification : Note","EAD Archive:Appraisal Information","EAD Archive:Biography or History","EAD Archive:Index","EAD Archive:Note","EAD Archive:Other Descriptive Data","EAD Archive:Processing Information","EAD Archive:Scope and Content","EAD Archive:Heading","EAD Archive:Table Head","PDF Text:Text",tags,file,itemType,collection,public,featured
"Atracció i projecció econòmica de Barcelona / Conferència","Maragall, Pasqual, 1941-",,1988-06-09,Conferència,Textual,Català,Economia,,,"Inicitives SA, Barcelona Activa, Area per al Desenvolupament Econòmic i Social, Prac Tecnològic del Vallès, Mercabarna, Barcelona Tecnologia. Túnel d´Horta, Cinturons. Poble Nou, Montjuic, Vall d´Hebron, Diagonal. Universitat - Empresa - Ciutat.","Cercle d'Economia",,"Aquest document forma part del fons municipal de l’Ajuntament de Barcelona (productor de la documentació) i és còpia digital de l’original custodiat a l’Arxiu Municipal Contemporani de Barcelona.",,,4069,,,,,,,,,,,,,,,,,,,,,,,,,,,,,,,,,,,,,,,,,,,,,,,,,,,,,,,,,,,,,,,,,,,,,,,,,,,,,,,,,,,,,,Document,,,,,,,,,,,,,,"Discursos i conferències",https://www.arxiupmaragall.catalunyaeuropa.net/files/original/30/1163/19880609d_00297.pdf,,"09.01. Activitat de representació (com a Alcalde)",1,0
"Barcelona '92: efecte sobre l'economia de les ciutats Conferència de l'Excm. Sr. Alcalde, Pasqual Maragall, a la Cambra Oficial de Comerç, Indústria i Navegació de València","Maragall, Pasqual, 1941-",,1988-12-22,Conferència,Textual,Català,"Jocs Olímpics (25ns : 1992 : Barcelona, Catalunya)","Conté notes i correccions manuscrites de PM.",,"Estructura de la conferència: - La importància economico-financera del sistema municipal de Barcelona. - Area Metropolitana. - El present depèn del futur. - Inversió olímpica. - Macroregió 2000. - Més enllà del '92, Pla Estratègic i Barcelona '93. La competència entre territoris, entre països, si es considera des d'una concepció política, és una competència entre ciutats.","Cambra Oficial de Comerç, Indústria i Navegació de València",,"Aquest document forma part del fons municipal de l’Ajuntament de Barcelona (productor de la documentació) i és còpia digital de l’original custodiat a l’Arxiu Municipal Contemporani de Barcelona.",,,4085,,,,,,,,,,,,,,,,,,,,,,,,,,,,,,,,,,,,,,,,,,,,,,,,,,,,,,,,,,,,,,,,,,,,,,,,,,,,,,,,,,,,,,Document,,,,,,,,,,,,,,"Discursos i conferències",https://www.arxiupmaragall.catalunyaeuropa.net/files/original/30/1179/19881222d_00315.pdf,,"09.01. Activitat de representació (com a Alcalde)",1,0
"Barcelona, ciudad estratégica","Maragall, Pasqual, 1941-",,1988-11-17,Conferència,Textual,Castellà,Barcelona,"Conté notes manuscrites de PM.",,,"Colegio Mayor Mendel (Madrid)",,"Aquest document forma part del fons municipal de l’Ajuntament de Barcelona (productor de la documentació) i és còpia digital de l’original custodiat a l’Arxiu Municipal Contemporani de Barcelona.",,,,,,,,,,,,,,,,,,,,,,"Cronologia PM",,,,,,,,,,,,,,,,,,,,,,,,,,,,,,,,,,,,,,,,,,,,,,,,,,,,,,,,,,,,,,,,,,,Document,,,,,,,,,,,,,,"Discursos i conferències",https://www.arxiupmaragall.catalunyaeuropa.net/files/original/30/2586/19881117d_00314.pdf,,"09.01. Activitat de representació (com a Alcalde)",1,0
"Barcelona, un nou salt endavant","Maragall, Pasqual, 1941-",,1994-09-15,Discurs,Textual,Català,Competitivitat,,,,"Hotel Barceló Sants",,"Aquest document forma part del fons municipal de l’Ajuntament de Barcelona (productor de la documentació) i és còpia digital de l’original custodiat a l’Arxiu Municipal Contemporani de Barcelona.",,,4310,,,,,,,,,,,,,,,,,,,,,,,,,,,,,,,,,,,,,,,,,,,,,,,,,,,,,,,,,,,,,,,,,,,,,,,,,,,,,,,,,,,,,,Document,,,,,,,,,,,,,,"Discursos i conferències",https://www.arxiupmaragall.catalunyaeuropa.net/files/original/30/1404/19940915d_00640.pdf,,"09.01. Activitat de representació (com a Alcalde)",1,0
"Barcelona: horitzó 1992 / Conferència","Maragall, Pasqual, 1941-",,1986-07-07,Conferència,Textual,Català,Barcelona,"Conté notes manuscrites de PM.",,,"Societat Catalana d'Estudis Jurídics i Socials",,"Aquest document forma part del fons municipal de l’Ajuntament de Barcelona (productor de la documentació) i és còpia digital de l’original custodiat a l’Arxiu Municipal Contemporani de Barcelona.",,,3940,,,,,,,,,,,,,,,,,,,,,,,,,,,,,,,,,,,,,,,,,,,,,,,,,,,,,,,,,,,,,,,,,,,,,,,,,,,,,,,,,,,,,,Document,,,,,,,,,,,,,,"Discursos i conferències",https://www.arxiupmaragall.catalunyaeuropa.net/files/original/30/1034/19860707d_00141.pdf,,"09.01. Activitat de representació (com a Alcalde)",1,0
"Barcelona: proyectos para el siglo XXI. La apuesta logística. Conferència. Proposta d'intervenció. Resum. Transcripció notes manuscrites.","Maragall, Pasqual, 1941-",,1996-04-22,Conferència,Textual,Català,Competitivitat,,,,"Cercle d'Economia",,"Aquest document forma part del fons municipal de l’Ajuntament de Barcelona (productor de la documentació) i és còpia digital de l’original custodiat a l’Arxiu Municipal Contemporani de Barcelona.",,,4389,,,,,,,,,,,,,,,,,,,,,,,,,,,,,,,,,,,,,,,,,,,,,,,,,,,,,,,,,,,,,,,,,,,,,,,,,,,,,,,,,,,,,,Document,,,,,,,,,,,,,,"Discursos i conferències",https://www.arxiupmaragall.catalunyaeuropa.net/files/original/30/1483/19960422d_00723_LD.pdf,,"09.01. Activitat de representació (com a Alcalde)",1,0
"Cataluña no pide nada para ella que no pueda ser para todos","Maragall, Pasqual, 1941-",,2005-11-24,Entrevista,Textual,Castellà,Catalunya,,"Actualidad Económica",,,,,,,,,,,,,,,,,,,,,,,,,,,,,,,,,,,,,,,,,,,,,,,,,,,,,,,,,,,,,,,,,,,,,,,,,,,,,,,,,,,,,,,,,,,,,Document,,,,,,,,,,,,,,Entrevistes,https://www.arxiupmaragall.catalunyaeuropa.net/files/original/27/1614/0000000775.pdf,,"12.01. Activitat de representació (com a President)",1,0
"Catalunya i els Jocs Olímpics / Conferència, organitzada pel Col.legi d'Economistes de Lleida","Maragall, Pasqual, 1941-",,1987-01-16,Conferència,Textual,Català,"Jocs Olímpics (25ns : 1992 : Barcelona, Catalunya)","Conté notes manuscrites de PM.",,"Estructura de la conferència: - JJ.OO catalitzadors. - JJ.OO mobilitzadors pacífics. - Referència a proves de piragüisme. - Catalunya necessita Barcelona. - Catalunya sistema de ciutats. - Referència a l'ordenació territorial.","Pavelló de Vidre dels Camps Elisis, Lleida",,"Aquest document forma part del fons municipal de l’Ajuntament de Barcelona (productor de la documentació) i és còpia digital de l’original custodiat a l’Arxiu Municipal Contemporani de Barcelona.",,,3979,,,,,,,,,,,,,,,,,,,,,,,,,,,,,,,,,,,,,,,,,,,,,,,,,,,,,,,,,,,,,,,,,,,,,,,,,,,,,,,,,,,,,,Document,,,,,,,,,,,,,,"Discursos i conferències",https://www.arxiupmaragall.catalunyaeuropa.net/files/original/30/1073/19870116d_00187.pdf,,"09.01. Activitat de representació (com a Alcalde)",1,0
"Catalunya oberta: una estratègia econòmica","Maragall, Pasqual, 1941-",,2004-03-22,Conferència,Textual,Català,"Benestar Social",,,,"Cambra de Comerç de Barcelona",,"Aquest document és còpia digital de l'original custodiat a l'Arxiu Nacional de Catalunya.",,,1650,,,,,,,,,,,,,,,,,,,,,,,,,,,,,,,,,,,,,,,,,,,,,,,,,,,,,,,,,,,,,,,,,,,,,,,,,,,,,,,,,,,,,,Document,,,,,,,,,,,,,,"Discursos i conferències",https://www.arxiupmaragall.catalunyaeuropa.net/files/original/27/168/20040322.pdf,Text,"12.01. Activitat de representació (com a President)",1,0
"Cerimònia Inaugural del 45è Congrés de la International Fiscal Association","Maragall, Pasqual, 1941-",,1991-10-06,Discurs,Textual,Català,"Congressos i conferències",,,"La valoració dels béns immobles a efectes fiscals interessa als municipis. Finançament a les grans arees metropolitanes. Mecanismes tant jurídics com econòmics per garantir un equilibri econòmic en la prestació de serveis públics.","Palau de la Música Catalana",,"Aquest document forma part del fons municipal de l’Ajuntament de Barcelona (productor de la documentació) i és còpia digital de l’original custodiat a l’Arxiu Municipal Contemporani de Barcelona.",,,4158,,,,,,,,,,,,,,,,,,,,,,,,,,,,,,,,,,,,,,,,,,,,,,,,,,,,,,,,,,,,,,,,,,,,,,,,,,,,,,,,,,,,,,Document,,,,,,,,,,,,,,"Discursos i conferències",https://www.arxiupmaragall.catalunyaeuropa.net/files/original/30/1252/19911006d_00452.pdf,,"09.01. Activitat de representació (com a Alcalde)",1,0
