﻿"Dublin Core:Title","Dublin Core:Creator","Dublin Core:Contributor","Dublin Core:Date","Dublin Core:Type","Dublin Core:Format","Dublin Core:Language","Dublin Core:Subject","Dublin Core:Description","Dublin Core:Source","Dublin Core:Abstract","Dublin Core:Spatial Coverage","Dublin Core:Publisher","Dublin Core:Provenance","Dublin Core:Rights","Dublin Core:Relation","Dublin Core:Identifier","Dublin Core:Coverage","Dublin Core:Alternative Title","Dublin Core:Table Of Contents","Dublin Core:Date Available","Dublin Core:Date Created","Dublin Core:Date Accepted","Dublin Core:Date Copyrighted","Dublin Core:Date Submitted","Dublin Core:Date Issued","Dublin Core:Date Modified","Dublin Core:Date Valid","Dublin Core:Access Rights","Dublin Core:License","Dublin Core:Conforms To","Dublin Core:Has Format","Dublin Core:Has Part","Dublin Core:Has Version","Dublin Core:Is Format Of","Dublin Core:Is Part Of","Dublin Core:Is Referenced By","Dublin Core:Is Replaced By","Dublin Core:Is Required By","Dublin Core:Is Version Of","Dublin Core:References","Dublin Core:Replaces","Dublin Core:Requires","Dublin Core:Extent","Dublin Core:Medium","Dublin Core:Bibliographic Citation","Dublin Core:Temporal Coverage","Dublin Core:Accrual Method","Dublin Core:Accrual Periodicity","Dublin Core:Accrual Policy","Dublin Core:Audience","Dublin Core:Audience Education Level","Dublin Core:Mediator","Dublin Core:Instructional Method","Dublin Core:Rights Holder","Item Type Metadata:Text","Item Type Metadata:Interviewer","Item Type Metadata:Interviewee","Item Type Metadata:Location","Item Type Metadata:Transcription","Item Type Metadata:URL local","Item Type Metadata:Format original","Item Type Metadata:Dimensions físiques","Item Type Metadata:Duration","Item Type Metadata:Compression","Item Type Metadata:Producer","Item Type Metadata:Director","Item Type Metadata:Bit Rate/Frequency","Item Type Metadata:Time Summary","Item Type Metadata:Email Body","Item Type Metadata:Subject Line","Item Type Metadata:From","Item Type Metadata:To","Item Type Metadata:CC","Item Type Metadata:BCC","Item Type Metadata:Number of Attachments","Item Type Metadata:Standards","Item Type Metadata:Objectives","Item Type Metadata:Materials","Item Type Metadata:Lesson Plan Text","Item Type Metadata:URL","Item Type Metadata:Event Type","Item Type Metadata:Participants","Item Type Metadata:Birth Date","Item Type Metadata:Birthplace","Item Type Metadata:Death Date","Item Type Metadata:Occupation","Item Type Metadata:Biographical Text","Item Type Metadata:Bibliography","Item Type Metadata:Edition Statement","Item Type Metadata:Publication Statement","Item Type Metadata:Note statement","Item Type Metadata:Profile description : Creation","Item Type Metadata:Profile description : Descriptive Rules","Item Type Metadata:Profile description : Language Usage","Item Type Metadata:Revision Description : Change","Item Type Metadata:Revision Description : List","Item Type Metadata:Front matter : Title page","Item Type Metadata:Front matter : Division","Item Type Metadata:Destinatari","Item Type Metadata:Número de caixa","Item Type Metadata:Localització de la caixa","EAD Archive:Level","EAD Archive:Arrangement","EAD Archive:Descriptive Identification : Heading","EAD Archive:Descriptive Identification : Note","EAD Archive:Appraisal Information","EAD Archive:Biography or History","EAD Archive:Index","EAD Archive:Note","EAD Archive:Other Descriptive Data","EAD Archive:Processing Information","EAD Archive:Scope and Content","EAD Archive:Heading","EAD Archive:Table Head","PDF Text:Text",tags,file,itemType,collection,public,featured
"Visita del Príncep d’Astúries i de Girona a l'Ajuntament de Barcelona. Paraules del Senyor Alcalde","Maragall, Pasqual, 1941-",,1990-04-21,Discurs,Textual,Català,"Drets constitucionals",,,,"Saló de Cent",,"Aquest document forma part del fons municipal de l’Ajuntament de Barcelona (productor de la documentació) i és còpia digital de l’original custodiat a l’Arxiu Municipal Contemporani de Barcelona.",,,4123,,,,,,,,,,,,,,,,,,,,,,,,,,,,,,,,,,,,,,,,,,,,,,,,,,,,,,,,,,,,,,,,,,,,,,,,,,,,,,,,,,,,,,Document,,,,,,,,,,,,,,"Discursos i conferències",https://www.arxiupmaragall.catalunyaeuropa.net/files/original/30/1217/19900421d_00377.pdf,,"09.01. Activitat de representació (com a Alcalde)",1,0
"Two romantic articles by Keynes: Economic possibilities of our grandchildren (1930) and On National Self-sufficiency (1933)","Maragall, Pasqual, 1941-",,1972,Article,Textual,Anglès,Economia,"Treball a la New School for Social Research de Nova York, Economics, 251. Spring Term.",,,,,,,,,,,,,,,,,,,,,,,,,,,,,,,,,,,,,,,,,,,,,,,,,,,,,,,,,,,,,,,,,,,,,,,,,,,,,,,,,,,,,,,,,,,,,,Document,"Original en paper a la caixa 756.",,,,,,,,,,,,,Articles,https://www.arxiupmaragall.catalunyaeuropa.net/files/original/17/2524/1972_TwoRomanticArticlesByKeynes_PM.pdf,,"01.01.02. Activitat acadèmica",1,0
"Transcripció del Parlament de l'alcalde en motiu del 90è aniversari de l'Institut d'Estudis Catalans","Maragall, Pasqual, 1941-",,1997-06-18,Discurs,Textual,Català,Catalanisme,,,,"IEC, Barcelona",,"Aquest document forma part del fons municipal de l’Ajuntament de Barcelona (productor de la documentació) i és còpia digital de l’original custodiat a l’Arxiu Municipal Contemporani de Barcelona.",,,4430,,,,,,,,,,,,,,,,,,,,,,,,,,,,,,,,,,,,,,,,,,,,,,,,,,,,,,,,,,,,,,,,,,,,,,,,,,,,,,,,,,,,,,Document,,,,,,,,,,,,,,"Discursos i conferències",https://www.arxiupmaragall.catalunyaeuropa.net/files/original/30/1524/19970618d-00769_LD.pdf,,"09.01. Activitat de representació (com a Alcalde)",1,0
"Transcripció de la conferència de l'alcalde a Tribuna Barcelona","Maragall, Pasqual, 1941-",,1997-07-14,Conferència,Textual,Català,Democràcia,"Inclou al final la presentació de Josep Ramoneda com a director del CCCB.",,,"Tribuna Barcelona",,"Aquest document forma part del fons municipal de l’Ajuntament de Barcelona (productor de la documentació) i és còpia digital de l’original custodiat a l’Arxiu Municipal Contemporani de Barcelona.",,,4434,,,,,,,,,,,,,,,,,,,,,,,,,,,,,,,,,,,,,,,,,,,,,,,,,,,,,,,,,,,,,,,,,,,,,,,,,,,,,,,,,,,,,,Document,,,,,,,,,,,,,,"Discursos i conferències",https://www.arxiupmaragall.catalunyaeuropa.net/files/original/30/1528/19970714d_00774.pdf,,"09.01. Activitat de representació (com a Alcalde)",1,0
"Text del pregó pronunciat per l'alcalde a la Festa Major de Cornellà","Maragall, Pasqual, 1941-",,1997-05-29,Discurs,Textual,Castellà,Municipis,,,,"Cornellà de Llobregat",,"Aquest document forma part del fons municipal de l’Ajuntament de Barcelona (productor de la documentació) i és còpia digital de l’original custodiat a l’Arxiu Municipal Contemporani de Barcelona.",,,4426,,,,,,,,,,,,,,,,,,,,,,,,,,,,,,,,,,,,,,,,,,,,,,,,,,,,,,,,,,,,,,,,,,,,,,,,,,,,,,,,,,,,,,Document,,,,,,,,,,,,,,"Discursos i conferències",https://www.arxiupmaragall.catalunyaeuropa.net/files/original/30/1520/19970529d_00763.pdf,,"09.01. Activitat de representació (com a Alcalde)",1,0
"Text del discurs pronunciat per Pasqual Maragall, President de la Corporació Metropolitana, davant la tomba de Ramón Fernández Jurado","Maragall, Pasqual, 1941-",,1984-09-11,Discurs,Textual,Català,Història,,,,Castelldefells,,"Aquest document forma part del fons municipal de l’Ajuntament de Barcelona (productor de la documentació) i és còpia digital de l’original custodiat a l’Arxiu Municipal Contemporani de Barcelona.",,,3872,,,,,,,,,,,,,,,,,,,,,,,,,,,,,,,,,,,,,,,,,,,,,,,,,,,,,,,,,,,,,,,,,,,,,,,,,,,,,,,,,,,,,,Document,,,,,,,,,,,,,,"Discursos i conferències",https://www.arxiupmaragall.catalunyaeuropa.net/files/original/30/966/19840911d_00045.pdf,,"09.01. Activitat de representació (com a Alcalde)",1,0
"Sessió sobre ""Història i Prospectiva"" / Conferència dins el Programa Commemoratiu del Centenari de la Cambra de Comerç","Maragall, Pasqual, 1941-",,1986-02-20,Conferència,Textual,Català,Barcelona,"Conté notes manuscrites de PM.",,,"Llotja de Mar",,"Aquest document forma part del fons municipal de l’Ajuntament de Barcelona (productor de la documentació) i és còpia digital de l’original custodiat a l’Arxiu Municipal Contemporani de Barcelona.",,,3908,,,,,,,,,,,,,,,,,,,,,,,,,,,,,,,,,,,,,,,,,,,,,,,,,,,,,,,,,,,,,,,,,,,,,,,,,,,,,,,,,,,,,,Document,,,,,,,,,,,,,,"Discursos i conferències",https://www.arxiupmaragall.catalunyaeuropa.net/files/original/30/1002/19860220d_0054.pdf,,"09.01. Activitat de representació (com a Alcalde)",1,0
"Proposta de paraules. Presentació conferenciant. Conferència de l'Onze de Setembre","Maragall, Pasqual, 1941-",,1997-09-10,Conferència,Textual,Català,Història,,,,"Saló de Cent",,"Aquest document forma part del fons municipal de l’Ajuntament de Barcelona (productor de la documentació) i és còpia digital de l’original custodiat a l’Arxiu Municipal Contemporani de Barcelona.",,,4442,,,,,,,,,,,,,,,,,,,,,,,,,,,,,,,,,,,,,,,,,,,,,,,,,,,,,,,,,,,,,,,,,,,,,,,,,,,,,,,,,,,,,,Document,,,,,,,,,,,,,,"Discursos i conferències",https://www.arxiupmaragall.catalunyaeuropa.net/files/original/30/1536/19971110d_00779.pdf,,"09.01. Activitat de representació (com a Alcalde)",1,0
"Presentació del conferenciant Sr. Santiago Marraco Solana dins el Cicle Barcelona Solidària","Maragall, Pasqual, 1941-",,1986-04-22,Conferència,Textual,Català,"Espanya plural",,,,"Saló de Cent",,"Aquest document forma part del fons municipal de l’Ajuntament de Barcelona (productor de la documentació) i és còpia digital de l’original custodiat a l’Arxiu Municipal Contemporani de Barcelona.",,,3921,,,,,,,,,,,,,,,,,,,,,,,,,,,,,,,,,,,,,,,,,,,,,,,,,,,,,,,,,,,,,,,,,,,,,,,,,,,,,,,,,,,,,,Document,,,,,,,,,,,,,,"Discursos i conferències",https://www.arxiupmaragall.catalunyaeuropa.net/files/original/30/1015/19860422d_00120.pdf,,"09.01. Activitat de representació (com a Alcalde)",1,0
"Presentació del conferenciant Sr. J.A. Ardanza, President del Govern Basc, dins el Cicle Barcelona Solidària","Maragall, Pasqual, 1941-",,1986-07-23,Conferència,Textual,Castellà,Biografies,,,,"Saló de Cent",,"Aquest document forma part del fons municipal de l’Ajuntament de Barcelona (productor de la documentació) i és còpia digital de l’original custodiat a l’Arxiu Municipal Contemporani de Barcelona.",,,3943,,,,,,,,,,,,,,,,,,,,,,,,,,,,,,,,,,,,,,,,,,,,,,,,,,,,,,,,,,,,,,,,,,,,,,,,,,,,,,,,,,,,,,Document,,,,,,,,,,,,,,"Discursos i conferències",https://www.arxiupmaragall.catalunyaeuropa.net/files/original/30/1037/19860725d_00144.pdf,,"09.01. Activitat de representació (com a Alcalde)",1,0
