﻿"Dublin Core:Title","Dublin Core:Creator","Dublin Core:Contributor","Dublin Core:Date","Dublin Core:Type","Dublin Core:Format","Dublin Core:Language","Dublin Core:Subject","Dublin Core:Description","Dublin Core:Source","Dublin Core:Abstract","Dublin Core:Spatial Coverage","Dublin Core:Publisher","Dublin Core:Provenance","Dublin Core:Rights","Dublin Core:Relation","Dublin Core:Identifier","Dublin Core:Coverage","Dublin Core:Alternative Title","Dublin Core:Table Of Contents","Dublin Core:Date Available","Dublin Core:Date Created","Dublin Core:Date Accepted","Dublin Core:Date Copyrighted","Dublin Core:Date Submitted","Dublin Core:Date Issued","Dublin Core:Date Modified","Dublin Core:Date Valid","Dublin Core:Access Rights","Dublin Core:License","Dublin Core:Conforms To","Dublin Core:Has Format","Dublin Core:Has Part","Dublin Core:Has Version","Dublin Core:Is Format Of","Dublin Core:Is Part Of","Dublin Core:Is Referenced By","Dublin Core:Is Replaced By","Dublin Core:Is Required By","Dublin Core:Is Version Of","Dublin Core:References","Dublin Core:Replaces","Dublin Core:Requires","Dublin Core:Extent","Dublin Core:Medium","Dublin Core:Bibliographic Citation","Dublin Core:Temporal Coverage","Dublin Core:Accrual Method","Dublin Core:Accrual Periodicity","Dublin Core:Accrual Policy","Dublin Core:Audience","Dublin Core:Audience Education Level","Dublin Core:Mediator","Dublin Core:Instructional Method","Dublin Core:Rights Holder","Item Type Metadata:Text","Item Type Metadata:Interviewer","Item Type Metadata:Interviewee","Item Type Metadata:Location","Item Type Metadata:Transcription","Item Type Metadata:URL local","Item Type Metadata:Format original","Item Type Metadata:Dimensions físiques","Item Type Metadata:Duration","Item Type Metadata:Compression","Item Type Metadata:Producer","Item Type Metadata:Director","Item Type Metadata:Bit Rate/Frequency","Item Type Metadata:Time Summary","Item Type Metadata:Email Body","Item Type Metadata:Subject Line","Item Type Metadata:From","Item Type Metadata:To","Item Type Metadata:CC","Item Type Metadata:BCC","Item Type Metadata:Number of Attachments","Item Type Metadata:Standards","Item Type Metadata:Objectives","Item Type Metadata:Materials","Item Type Metadata:Lesson Plan Text","Item Type Metadata:URL","Item Type Metadata:Event Type","Item Type Metadata:Participants","Item Type Metadata:Birth Date","Item Type Metadata:Birthplace","Item Type Metadata:Death Date","Item Type Metadata:Occupation","Item Type Metadata:Biographical Text","Item Type Metadata:Bibliography","Item Type Metadata:Edition Statement","Item Type Metadata:Publication Statement","Item Type Metadata:Note statement","Item Type Metadata:Profile description : Creation","Item Type Metadata:Profile description : Descriptive Rules","Item Type Metadata:Profile description : Language Usage","Item Type Metadata:Revision Description : Change","Item Type Metadata:Revision Description : List","Item Type Metadata:Front matter : Title page","Item Type Metadata:Front matter : Division","Item Type Metadata:Destinatari","Item Type Metadata:Número de caixa","Item Type Metadata:Localització de la caixa","EAD Archive:Level","EAD Archive:Arrangement","EAD Archive:Descriptive Identification : Heading","EAD Archive:Descriptive Identification : Note","EAD Archive:Appraisal Information","EAD Archive:Biography or History","EAD Archive:Index","EAD Archive:Note","EAD Archive:Other Descriptive Data","EAD Archive:Processing Information","EAD Archive:Scope and Content","EAD Archive:Heading","EAD Archive:Table Head","PDF Text:Text",tags,file,itemType,collection,public,featured
"Candidness: últim adéu a Santiago Costa","Maragall, Pasqual, 1941-",,2005-07-27,Article,Textual,Català,"Costa, Santiago",,"La Vanguardia",,,,,,,1231,,,,,,,,,,,,,,,,,,,,,,,,,,,,,,,,,,,,,,,,,,,,,,,,,,,,,,,,,,,,,,,,,,,,,,,,,,,,,,,,,,,,,,Document,,,"President de la Generalitat de Catalunya",,,,,,,,,,,Articles,https://www.arxiupmaragall.catalunyaeuropa.net/files/original/27/760/20050727_LV.pdf,,"12.01. Activitat de representació (com a President)",1,0
"MARTA MATA. Tenaz y dulce","Maragall, Pasqual, 1941-",,2006-06-28,Article,Textual,Castellà,"Mata, Marta, 1926-2006","Article publicat simultàniament a El País i La Vanguardia amb motiu de la mort de Marta Mata.","La Vanguardia",,,,,,,1234,,,,,,,,,,,,,,,,,,,,,,,,,,,,,,,,,,,,,,,,,,,,,,,,,,,,,,,,,,,,,,,,,,,,,,,,,,,,,,,,,,,,,,Document,,,"President de la Generalitat de Catalunya",,,,,,,,,,,Articles,https://www.arxiupmaragall.catalunyaeuropa.net/files/original/27/763/20060628_LV.pdf,,"12.01. Activitat de representació (com a President)",1,0
"Catalunya está de luto. Joan Reventós","Maragall, Pasqual, 1941-",,2004-01-14,Article,Textual,Castellà,"Reventós, Joan, 1927-2004",,"La Vanguardia","També publicat en català a El Periódico (Catalunya està de dol)..",,,,,,1349,,,,,,,,,,,,,,,,,,,,,,,,,,,,,,,,,,,,,,,,,,,,,,,,,,,,,,,,,,,,,,,,,,,,,,,,,,,,,,,,,,,,,,Document,,,"President de la Generalitat de Catalunya",,,,,,,,,,,Articles,https://www.arxiupmaragall.catalunyaeuropa.net/files/original/27/771/20040114_LV.pdf,,"12.01. Activitat de representació (com a President)",1,0
"Ho va viure tot. Fallece el ex conseller Josep Laporte.","Maragall, Pasqual, 1941-",,2005-02-16,Article,Textual,Català,"Laporte i Salas, Josep, 1922-2005",,"La Vanguardia",,,,,,,1385,,,,,,,,,,,,,,,,,,,,,,,,,,,20050216_LV.pdf,,,,,,,,,,,,,,,,,,,,,,,,,,,,,,,,,,,,,,,,,,,,,,,,,,,,,,,,,,,Document,,,"President de la Generalitat de Catalunya",,,,,,,,,,,Articles,https://www.arxiupmaragall.catalunyaeuropa.net/files/original/27/780/20050216_LV.pdf,,"12.01. Activitat de representació (com a President)",1,0
"Llibertats, Catalunya, Europa","Maragall, Pasqual, 1941-",,2006-10-07,Article,Textual,Castellà,"Gutiérrez Díaz, Antoni, 1929-2006",,"La Vanguardia","Article en motiu de la mort d'Antoni Gutiérrez, Guti",,,,,,1398,,,,,,,,,,,,,,,,,,,,,,,,,,,20061007_LV.pdf,,,,,,,,,,,,,,,,,,,,,,,,,,,,,,,,,,,,,,,,,,,,,,,,,,,,,,,,,,,Document,,,"President de la Generalitat de Catalunya",,,,,,,,,,,Articles,https://www.arxiupmaragall.catalunyaeuropa.net/files/original/27/781/20061007_LV.pdf,,"12.01. Activitat de representació (com a President)",1,0
"El vecino Tierno","Maragall, Pasqual, 1941-",,1986-01-21,Article,Textual,Castellà,"Tierno Galván, Enrique, 1918-1986",,"El País",,,,,,,1073,,,,,,,,,,,,,,,,,,,,,,,,,,,,,,,,,,,,,,,,,,,,,,,,,,,,,,,,,,,,,,,,,,,,,,,,,,,,,,,,,,,,,,Document,,,,,,,,,,,,,,Articles,https://www.arxiupmaragall.catalunyaeuropa.net/files/original/30/806/0000001534.pdf,,"09.01. Activitat de representació (com a Alcalde)",1,0
"En recuerdo de José Manuel Arija","Maragall, Pasqual, 1941-",,1995-04-22,Article,Textual,Castellà,Necrologies,,"El País",,,,,,,1088,,,,,,,,,,,,,,,,,,,,,,,,,,,,,,,,,,,,,,,,,,,,,,,,,,,,,,,,,,,,,,,,,,,,,,,,,,,,,,,,,,,,,,Document,,,,,,,,,,,,,,Articles,https://www.arxiupmaragall.catalunyaeuropa.net/files/original/30/821/0000001546.pdf,,"09.01. Activitat de representació (com a Alcalde)",1,0
"Faustino y los demás","Maragall, Pasqual, 1941-",,2000-01-17,Article,Textual,Castellà,Necrologies,,"El País",,,,,,,1094,,,,,,,,,,,,,,,,,,,,,,,,,,,,,,,,,,,,,,,,,,,,,,,,,,,,,,,,,,,,,,,,,,,,,,,,,,,,,,,,,,,,,,Document,,,,,,,,,,,,,,Articles,https://www.arxiupmaragall.catalunyaeuropa.net/files/original/23/850/0000001551.pdf,,"04.02. Activitat política",1,0
"Chincha Choma (Alejandro García Durán)","Maragall, Pasqual, 1941-",,2000-06-05,Article,Textual,Castellà,"García Durán, Alejandro",,"El País",,,,,,,1095,,,,,,,,,,,,,,,,,,,,,,,,,,,,,,,,,,,,,,,,,,,,,,,,,,,,,,,,,,,,,,,,,,,,,,,,,,,,,,,,,,,,,,Document,,,,,,,,,,,,,,Articles,https://www.arxiupmaragall.catalunyaeuropa.net/files/original/23/851/0000001552.pdf,,"04.02. Activitat política",1,0
"Juan Tomás de Salas, uno de los pocos","Maragall, Pasqual, 1941-",,2000-11-18,Article,Textual,Castellà,Necrologies,,"El País",,,,,,,1099,,,,,,,,,,,,,,,,,,,,,,,,,,,,,,,,,,,,,,,,,,,,,,,,,,,,,,,,,,,,,,,,,,,,,,,,,,,,,,,,,,,,,,Document,,,,,,,,,,,,,,Articles,https://www.arxiupmaragall.catalunyaeuropa.net/files/original/23/855/0000001556.pdf,,"04.02. Activitat política",1,0
