﻿"Dublin Core:Title","Dublin Core:Creator","Dublin Core:Contributor","Dublin Core:Date","Dublin Core:Type","Dublin Core:Format","Dublin Core:Language","Dublin Core:Subject","Dublin Core:Description","Dublin Core:Source","Dublin Core:Abstract","Dublin Core:Spatial Coverage","Dublin Core:Publisher","Dublin Core:Provenance","Dublin Core:Rights","Dublin Core:Relation","Dublin Core:Identifier","Dublin Core:Coverage","Dublin Core:Alternative Title","Dublin Core:Table Of Contents","Dublin Core:Date Available","Dublin Core:Date Created","Dublin Core:Date Accepted","Dublin Core:Date Copyrighted","Dublin Core:Date Submitted","Dublin Core:Date Issued","Dublin Core:Date Modified","Dublin Core:Date Valid","Dublin Core:Access Rights","Dublin Core:License","Dublin Core:Conforms To","Dublin Core:Has Format","Dublin Core:Has Part","Dublin Core:Has Version","Dublin Core:Is Format Of","Dublin Core:Is Part Of","Dublin Core:Is Referenced By","Dublin Core:Is Replaced By","Dublin Core:Is Required By","Dublin Core:Is Version Of","Dublin Core:References","Dublin Core:Replaces","Dublin Core:Requires","Dublin Core:Extent","Dublin Core:Medium","Dublin Core:Bibliographic Citation","Dublin Core:Temporal Coverage","Dublin Core:Accrual Method","Dublin Core:Accrual Periodicity","Dublin Core:Accrual Policy","Dublin Core:Audience","Dublin Core:Audience Education Level","Dublin Core:Mediator","Dublin Core:Instructional Method","Dublin Core:Rights Holder","Item Type Metadata:Text","Item Type Metadata:Interviewer","Item Type Metadata:Interviewee","Item Type Metadata:Location","Item Type Metadata:Transcription","Item Type Metadata:URL local","Item Type Metadata:Format original","Item Type Metadata:Dimensions físiques","Item Type Metadata:Duration","Item Type Metadata:Compression","Item Type Metadata:Producer","Item Type Metadata:Director","Item Type Metadata:Bit Rate/Frequency","Item Type Metadata:Time Summary","Item Type Metadata:Email Body","Item Type Metadata:Subject Line","Item Type Metadata:From","Item Type Metadata:To","Item Type Metadata:CC","Item Type Metadata:BCC","Item Type Metadata:Number of Attachments","Item Type Metadata:Standards","Item Type Metadata:Objectives","Item Type Metadata:Materials","Item Type Metadata:Lesson Plan Text","Item Type Metadata:URL","Item Type Metadata:Event Type","Item Type Metadata:Participants","Item Type Metadata:Birth Date","Item Type Metadata:Birthplace","Item Type Metadata:Death Date","Item Type Metadata:Occupation","Item Type Metadata:Biographical Text","Item Type Metadata:Bibliography","Item Type Metadata:Edition Statement","Item Type Metadata:Publication Statement","Item Type Metadata:Note statement","Item Type Metadata:Profile description : Creation","Item Type Metadata:Profile description : Descriptive Rules","Item Type Metadata:Profile description : Language Usage","Item Type Metadata:Revision Description : Change","Item Type Metadata:Revision Description : List","Item Type Metadata:Front matter : Title page","Item Type Metadata:Front matter : Division","Item Type Metadata:Destinatari","Item Type Metadata:Número de caixa","Item Type Metadata:Localització de la caixa","EAD Archive:Level","EAD Archive:Arrangement","EAD Archive:Descriptive Identification : Heading","EAD Archive:Descriptive Identification : Note","EAD Archive:Appraisal Information","EAD Archive:Biography or History","EAD Archive:Index","EAD Archive:Note","EAD Archive:Other Descriptive Data","EAD Archive:Processing Information","EAD Archive:Scope and Content","EAD Archive:Heading","EAD Archive:Table Head","PDF Text:Text",tags,file,itemType,collection,public,featured
"Lliurament de les Medalles i Plaques Francesc Macià al mèrit laboral","Maragall, Pasqual, 1941-",,2006-02-01,Discurs,Textual,Català,Ocupació,,,,"Reials Drassanes. Barcelona",,"Aquest document és còpia digital de l'original custodiat a l'Arxiu Nacional de Catalunya.",,,1731,,,,,,,,,,,,,,,,,,,,,,,,,,,,,,,,,,,,,,,,,,,,,,,,,,,,,,,,,,,,,,,,,,,,,,,,,,,,,,,,,,,,,,Document,,,,,,,,,,,,,,"Discursos i conferències",https://www.arxiupmaragall.catalunyaeuropa.net/files/original/27/249/20060201.pdf,Text,"12.01. Activitat de representació (com a President)",1,0
"Parlem dels nostres fills","Maragall, Pasqual, 1941-",,2005-12-04,Article,Textual,Català,Joves,,"El Periódico de Catalunya",,,,,,,1331,,,,,,,,,,,,,,,,,,,,,,,,,,,,,,,,,,,,,,,,,,,,,,,,,,,,,,,,,,,,,,,,,,,,,,,,,,,,,,,,,,,,,,Document,,,,,,,,,,,,,,Articles,https://www.arxiupmaragall.catalunyaeuropa.net/files/original/27/1677/0000000637.pdf,,"12.01. Activitat de representació (com a President)",1,0
"Debat de Política General","Maragall, Pasqual, 1941-",,2005-10-18,"Intervenció al Parlament",Textual,Català,Demografia,,,,"Parlament de Catalunya",,"Aquest document és còpia digital de l'original custodiat a l'Arxiu Nacional de Catalunya.",,,1702,,,,,,,,,,,,,,,,,,,,,,,,,,,,,,,,,,,,,,,,,,,,,,,,,,,,,,,,,,,,,,,,,,,,,,,,,,,,,,,,,,,,,,Document,,,,,,,,,,,,,,"Discursos i conferències",https://www.arxiupmaragall.catalunyaeuropa.net/files/original/27/220/20051018.pdf,Text,"12.01. Activitat de representació (com a President)",1,0
"Acte commemoratiu del centenari de la Cambra de Comerç de Sant Feliu de Guíxols","Maragall, Pasqual, 1941-",,2005-07-21,Discurs,Textual,Català,Comerç,,,,"Sant Feliu de Guíxols",,"Aquest document és còpia digital de l'original custodiat a l'Arxiu Nacional de Catalunya.",,,1694,,,,,,,,,,,,,,,,,,,,,,,,,,,,,,,,,,,,,,,,,,,,,,,,,,,,,,,,,,,,,,,,,,,,,,,,,,,,,,,,,,,,,,Document,,,,,,,,,,,,,,"Discursos i conferències",https://www.arxiupmaragall.catalunyaeuropa.net/files/original/27/212/20050721.pdf,Text,"12.01. Activitat de representació (com a President)",1,0
"La innovación es cosa de todos","Maragall, Pasqual, 1941-",,2005-06-20,Article,Textual,Castellà,Competitivitat,,"Cinco Días",,,,,,,1339,,,,,,,,,,,,,,,,,,,,,,,,,,,,,,,,,,,,,,,,,,,,,,,,,,,,,,,,,,,,,,,,,,,,,,,,,,,,,,,,,,,,,,Document,,,,,,,,,,,,,,Articles,https://www.arxiupmaragall.catalunyaeuropa.net/files/original/27/1682/0000000645.pdf,,"12.01. Activitat de representació (com a President)",1,0
"Discurs del president de la Generalitat en la inauguració de 12è Congrés de la UGT a Catalunya","Maragall, Pasqual, 1941-",,2005-06-20,Discurs,Textual,Català,"Benestar Social",,,,"Seu Vella. Lleida",,"Aquest document és còpia digital de l'original custodiat a l'Arxiu Nacional de Catalunya.",,,1689,,,,,,,,,,,,,,,,,,,,,,,,,,,,,,,,,,,,,,,,,,,,,,,,,,,,,,,,,,,,,,,,,,,,,,,,,,,,,,,,,,,,,,Document,,,,,,,,,,,,,,"Discursos i conferències",https://www.arxiupmaragall.catalunyaeuropa.net/files/original/27/207/20050620.pdf,Text,"12.01. Activitat de representació (com a President)",1,0
"40è Aniversari de Comissions Obreres de Catalunya","Maragall, Pasqual, 1941-",,2005-03-05,Discurs,Textual,Català,"Benestar Social",,,,Barcelona,,"Aquest document és còpia digital de l'original custodiat a l'Arxiu Nacional de Catalunya.",,,1677,,,,,,,,,,,,,,,,,,,,,,,,,,,,,,,,,,,,,,,,,,,,,,,,,,,,,,,,,,,,,,,,,,,,,,,,,,,,,,,,,,,,,,Document,,,,,,,,,,,,,,"Discursos i conferències",https://www.arxiupmaragall.catalunyaeuropa.net/files/original/27/195/20050305.pdf,Text,"12.01. Activitat de representació (com a President)",1,0
"Europa i l'ocupació","Maragall, Pasqual, 1941-","Muñoz, Xavier",1997-07-07,Debat,Textual,Català,Europa,"15 p. Intervenció de Maragall al sopar-col·loqui organitzat pel Grup Claris",,,,,"Aquest document és còpia digital de l'original custodiat a l'Arxiu Nacional de Catalunya.",,,,,,,,,,,,,,,,,,,,,,,,,,,,,,,,,,,,,,,,,,,,,,,,,,,,,,,,,,,,,,,,,,,,,,,,,,,,,,,,,,,,,,,,,Document,"UI 100",,,,,,,,,,,,,Debats,https://www.arxiupmaragall.catalunyaeuropa.net/files/original/23/2787/19970707_EuropaOcupacio_DebatGrupClaris_PM.pdf,,"04.02. Activitat política",1,0
"Conferència inaugural de les jornades ""l'Odissea de l'ocupació"". 10è aniversari Barcelona Activa","Maragall, Pasqual, 1941-",,1997-06-09,Conferència,Textual,Castellà,Ocupació,,,,"Saló de Cent",,"Aquest document forma part del fons municipal de l’Ajuntament de Barcelona (productor de la documentació) i és còpia digital de l’original custodiat a l’Arxiu Municipal Contemporani de Barcelona.",,,4429,,,,,,,,,,,,,,,,,,,,,,,,,,,,,,,,,,,,,,,,,,,,,,,,,,,,,,,,,,,,,,,,,,,,,,,,,,,,,,,,,,,,,,Document,,,,,,,,,,,,,,"Discursos i conferències",https://www.arxiupmaragall.catalunyaeuropa.net/files/original/30/1523/19970609d_00766.pdf,,"09.01. Activitat de representació (com a Alcalde)",1,0
"Xerrada Institut Besós","Maragall, Pasqual, 1941-",,1996-02-29,Discurs,Textual,Català,Competitivitat,,,,"Institut Besós, Barcelona",,"Aquest document forma part del fons municipal de l’Ajuntament de Barcelona (productor de la documentació) i és còpia digital de l’original custodiat a l’Arxiu Municipal Contemporani de Barcelona.",,,4384,,,,,,,,,,,,,,,,,,,,,,,,,,,,,,,,,,,,,,,,,,,,,,,,,,,,,,,,,,,,,,,,,,,,,,,,,,,,,,,,,,,,,,Document,,,,,,,,,,,,,,"Discursos i conferències",https://www.arxiupmaragall.catalunyaeuropa.net/files/original/30/1478/19960229d_00717.pdf,,"09.01. Activitat de representació (com a Alcalde)",1,0
